{"text_format":"1","workbook":"xlsx","n_sheets":13,"sheets":["Start Here!","Requirements COMcheck","As-Built COMcheck","Invoices COMcheck","Requirements Individual Files","Sq. Ft. Area Individual Files","Fixt List Individual Files","Wattage Individual Files","Invoices Individual Files","Helpful Tips Individual Files","RevisionHistory","Helpful Tips COMcheck","Admin_Lists"],"not_rendered":{"charts":0,"images":12,"macros":1,"external_links":0,"defined_names":5,"comments":2,"pivot_tables":0},"unopened":[],"bounds":{"document_bytes":16777216,"sheet_cells":100000,"rows_first":2000,"rows_last":500,"rows_between":2000,"halvings":0,"cell_chars":16384,"cell_head_chars":4096},"cells_cut":0,"cells_raw":0,"read":"whole","date_system":"1900"}

{"sheet":"Start Here!","index":0,"n_rows":73,"n_cols":35,"rows_kept":73,"cut":false,"hidden":false,"merged":[[32,13,32,17],[20,13,20,17],[23,18,24,18],[26,18,27,18],[28,18,29,18],[25,13,25,17],[26,13,27,17],[28,13,29,17],[30,13,30,17],[31,13,31,17],[23,13,24,17],[56,34,56,38],[54,34,54,38],[55,29,55,30],[55,34,55,38],[54,29,54,30],[65,30,69,30],[53,29,53,30],[21,9,21,10],[18,1,18,2],[18,3,18,11],[38,1,39,1],[25,9,25,10],[26,9,26,10],[27,9,27,10],[22,9,22,10],[29,2,29,11],[23,9,23,10],[24,9,24,10],[22,6,22,7],[56,29,56,30],[22,13,22,17],[8,13,8,14],[28,9,28,11],[16,3,16,11],[20,9,20,11],[21,13,21,17],[15,3,15,5],[15,10,15,11],[12,1,12,11],[23,6,24,7],[25,6,27,7],[8,2,8,10],[9,3,9,11],[1,1,1,11],[17,3,17,11],[13,1,13,2],[14,1,14,2],[15,1,15,2],[16,1,16,2],[17,1,17,2],[15,7,15,8],[13,3,13,11],[14,3,14,11],[5,3,5,11],[7,3,7,11],[2,1,2,11],[3,1,3,2],[4,1,4,10],[6,2,6,10]]}
[]
[null,"\nNew Construction Interior Lighting Power Density (LPD)\nSupplemental Workbook"]
[null,"Required documentation (COMcheck, floorplan and/or lighting layout) must be signed by a lighting professional with one or more of the following credentials:\n• Lighting Certification (LC) designation from National Council on Qualifications for the Lighting Professions (NCQLP)\n• Certified Lighting Efficiency Professional (CLEP) from the Association of Energy Engineers (AEE)\n• Certified Lighting Management Consultant (CLMC)\n• State of Wisconsin Professional Engineer (PE) License\n• Member of International Association of Lighting Designers (IALD)\n• Lighting Specialist II certification from National Association of Innovative Lighting Distributors (NAILD)\n• Commercial and Industrial Lighting Certificate from the Illuminating Engineering Society of America (IES)\n• Registered designer of electrical engineering systems in the state of Wisconsin\n• Member of the Institute of Electrical and Electronics Engineers (IEEE)\n• Other credential approved by Focus on Energy"]
[null,"Qualify the Project:"]
[null,"Do you have a completed As-built COMcheck using 2015 IECC signed by a credentialed lighting designer? ",null,null,null,null,null,null,null,null,null,"Select Yes or No"]
[null,null,null,{"$f":"IF(L5=\"Yes\",\"Select 'COMcheck' from the 'I'm providing the required info via:' drop-down below and proceed\",IF(L5=\"No\",\"Continue to next question\",IF(L5=\"Select Yes or No\",\" \")))","v":" "}]
[null,null,"Was the project overseen by a credentialed lighting designer (see list above)?",null,null,null,null,null,null,null,null,"Select Yes or No"]
[null,null,null,{"$f":"IF(L7=\"Yes\",\"Select 'Individual Files' from the 'I'm providing the required info via:' drop-down below and proceed\",IF(L7=\"No\",\"Continue to next question\",IF(L7=\"Select Yes or No\",\" \")))","v":" "}]
[null,null,"Are ALL fixtures installed either DLC or ENERGY STAR listed?",null,null,null,null,null,null,null,null,"Select Yes or No",null,"SPECTRUM entry:"]
[null,null,null,{"$f":"IF(L9=\"Yes\",\"Select 'Individual Files' from the 'I'm providing the required info via:' drop-down below and proceed\",IF(L9=\"No\",\"Project does not qualify, do not proceed\",IF(L9=\"Select Yes or No\",\" \")))","v":" "},null,null,null,null,null,null,null,null,null,"Unit of Measure Answer",{"$f":"W47","v":0},"net KWh reduced all areas"]
[null,null,null,null,null,null,null,null,null,null,null,null,null,"Units",1]
[null,null,null,null,null,null,null,null,null,null,null,null,null,"Measure Cost",{"$f":"Y47","v":0},"=1.30 * sq. ft or Tech Review override (manual entry)"]
[null,"Complete all fields below along with corresponding tabs. The incentive will be populated once all required information has been provided.",null,null,null,null,null,null,null,null,null,null,null,null,null,null,null,null,null,"Provide\nAS BUILT:","Possible ways to provide it:"]
[null,"Customer:",null,null,null,null,null,null,null,null,null,null,null,"kW Savings (Peak)",{"$f":"S47","v":0},"net savings all areas",null,null,null,"Sq Ft","COMcheck","Layout","Schedule","Submittal","Email","QPL snip"]
[null,"Trade Ally/Installer:",null,null,null,null,null,null,null,null,null,null,null,"kW Savings (1st Yr)",{"$f":"W47","v":0},"net savings all areas",null,null,null,"Wattage ","COMcheck","Layout","Schedule","Submittal","Email","QPL snip"]
[null,"Best Contact for LPD Questions:",null,null,null,null,"Email:",null,null,"Phone:",null,null,null,"kW Savings (Lifecycle)",{"$f":"X47","v":0},"net savings all areas",null,null,null,"Fixture list","COMcheck","Layout","Schedule","Submittal","Email","QPL snip"]
[null,"Project Description:",null,null,null,null,null,null,null,null,null,null,null,null,null,null,null,null,null,"Pro Sign-off","COMcheck","Layout","Schedule","Submittal","Email","QPL snip"]
[null,"Project Completion Date:",null,null,null,null,null,null,null,null,null,null,null,"Total Incentive",{"$f":"L37","v":0},"net incentive all areas",null,null,null,"Invoice","COMcheck","Layout","Schedule","Submittal","Email","QPL snip"]
[null,"Project Notes:",null,null,null,null,null,null,null,null,null,null,null,null,null,null,null,null,null,null,"COMcheck","Layout","Schedule","Submittal","Email","QPL snip"]
[]
{"$rows_left_out":54}
{"sheet":"Requirements COMcheck","index":1,"n_rows":0,"n_cols":0,"rows_kept":0,"cut":false,"hidden":true,"merged":[]}

{"sheet":"As-Built COMcheck","index":2,"n_rows":76,"n_cols":25,"rows_kept":76,"cut":false,"hidden":true,"merged":[[25,24,25,25],[27,24,27,25],[5,12,7,23],[8,12,9,23],[13,12,17,23],[0,12,0,21],[10,12,11,23],[11,4,12,9],[37,0,71,10],[0,0,5,10],[35,13,36,19]]}
["For data provided via COMcheck report\n - Provide the As-Built COMcheck report signed by a credentialed lighting professional\n       See Requirements tab for list of accepted credentials\n       If the COMcheck is not signed, go to Start Here tab and choose \"Individual Files\" from drop-down\n - If COMcheck lists more than 5 Area Types, contact Focus on Energy for assistance (business@focusonenergy.com)\n - See Helpful Tips tab for directions on inserting files",null,null,null,null,null,null,null,null,null,null,null,"Important Reminders for COMcheck Reports"]
[null,null,null,null,null,null,null,null,null,null,null,null,"Must use Energy Code \"2015 IECC\""]
[]
[]
[]
[null,null,null,null,null,null,null,null,null,null,null,null,"Must report As-Built conditions\nIf the installed scope of work differs from the initial COMcheck report, a revised COMcheck is required.  If discrepancies are found in review (ex.: COMcheck report, invoicing, in-person inspection), assumptions of higher value installed will be made."]
[]
[]
["Area 1:",null,"Total Sq. Ft:",null,"Found on COMcheck as \"Floor Area (ft2)\"",null,null,null,null,null,null,null,"Signature is required\nSignature on COMcheck report must include the lighting professional's credentials "]
[null,null,"Allowed Watts/ft2:",null,"Found on COMcheck as \"Allowed Watts / ft2\""]
[null,null,"Total Allowed Watts:",{"$f":"IFERROR(ROUND(D9*D10,0),\"\")","v":0},"This will calculate"]
[null,null,"New System Installed Watts:",null,"For Single Area Facility find on COMcheck as Total Proposed\nWatts - For multi-area add all wattage installed in Area 1 "]
[]
["Lines 15-33 used if multiple area types are listed on COMcheck, as indicated under \"Area Category\"",null,null,null,null,null,null,null,null,null,null,null,"For Projects with Multiple Area Types listed on COMcheck\n1. Follow example showing how to enter values\n2. If COMcheck lists more than 5 Area Types, contact Focus on Energy for assistance (business@focusonenergy.com)"]
[]
["Area 2:",null,"Total Sq. Ft:",null,"Found on COMcheck as \"Floor Area (ft2)\" "]
[null,null,"Allowed Watts/ft2:",null,"Found on COMcheck as \"Allowed Watts / ft2\""]
[null,null,"Total Allowed Watts:",{"$f":"IFERROR(ROUND(D16*D17,0),\"\")","v":0},"This will calculate"]
[null,null,"New System Installed Watts:",null,"On COMcheck add all wattage installed in Area 2",null,null,null,null,null,null,null,null,"Example: "]
[]
{"$rows_left_out":57}
{"sheet":"Invoices COMcheck","index":3,"n_rows":10,"n_cols":1,"rows_kept":10,"cut":false,"hidden":true,"merged":[[0,0,6,12],[10,0,44,10]]}
["Invoices to support COMcheck report data\n - Include invoices for all interior fixtures installed (indicate any items on invoice that are not part of the LPD offering)\n - Provide itemized invoices showing quantity and make/model number whenever possible, however a summary type invoice\n    is acceptable when submitted with COMcheck report\n - Include multiple files if appropriate\n - Supply as separate document attachment(s) if file size is prohibitive\n - See Helpful Tips tab for help inserting files"]
[]
[]
[]
[]
[]
[]
[]
[]
["Insert invoice(s) here:"]

{"sheet":"Requirements Individual Files","index":4,"n_rows":0,"n_cols":0,"rows_kept":0,"cut":false,"hidden":true,"merged":[]}

{"sheet":"Sq. Ft. Area Individual Files","index":5,"n_rows":32,"n_cols":11,"rows_kept":32,"cut":false,"hidden":true,"merged":[[9,6,11,11],[12,6,16,10],[0,0,6,6]]}
["Documentation Showing As-Built Square Footage\n - Building Plans must be signed by credentialed lighting professional \n      See Requirements tab for list of accepted credentials\n - Floorplan layout must include dimensions\n - Include multiple files if appropriate\n - Supply as separate document attachment(s) if file size is prohibitive\n - See Helpful Tips tab for help inserting files"]
[]
[]
[]
[]
[]
[]
[]
["Area 1:"]
[null,null,"Describe Area (ex.: Warehouse, Offices, etc.):",null,null,null,"For Projects with Multiple Area Use Types\n   Ex.: Warehouse (Area 1), Showroom (Area 2) and Offices (Area 3) within same facility\n"]
[null,{"$f":"IF(C15>1,\"Area 1 Sq. Ft.:\",IF(C15,\"\",\"Input Sq. Ft.:\"))","v":"Input Sq. Ft.:"},null,"The value entered will be verified on the floorplan layout"]
[]
["Area 2:",null,null,null,null,null,"1. Enter description of each Area\n2. Combine all of facility's common Use Type Areas within one area calculation\n       Example: Office spaces on Floor 1 (956 sq. ft.) + Floor 2 (5,110 sq. ft.) + Floor 3 \n       (554 sq. ft.) = 6,620 sq. ft. for the \"office\" area type \n3. Be sure all area types are clearly marked on building layout pdf "]
[null,null,"Describe Area:"]
[null,"Area 2 Sq. Ft.:",null,"The value entered will be verified on the floorplan layout"]
[]
["Area 3:"]
[null,null,"Describe Area:",null,null,null,"Example:"]
[null,"Area 3 Sq. Ft.:",null,"The value entered will be verified on the floorplan layout",null,null,null,"Area 1:"]
[null,null,null,null,null,null,null,null,"Area 1 Sq. Ft.:",42412,"The value entered will be verified on the pdf layout"]
{"$rows_left_out":13}
{"sheet":"Fixt List Individual Files","index":6,"n_rows":218,"n_cols":11,"rows_kept":218,"cut":false,"hidden":true,"merged":[[179,2,179,3],[9,0,9,4],[10,6,10,10],[0,0,7,10],[23,6,24,12],[11,2,11,3],[25,6,30,11],[177,0,177,4],[51,0,51,4],[93,0,93,4],[135,0,135,4],[53,2,53,3],[95,2,95,3],[137,2,137,3]]}
["List of ALL Interior fixtures installed (including quantity & wattage)\n - Do not include Exterior fixtures \n - If the project was NOT developed and overseen by a credentialed lighting professional (see Requirements tab for accepted credentials), then ALL lighting fixtures must be\n    ENERGY STAR or DLC SSL QPL listed (TRT V5.0 or higher). *Note* If even one fixture is not ENERGY STAR or DLC listed, the entire LPD measure is disqualified\n - Must report As-Built conditions. If discrepancies are found in review (ex.: fixtures listed, invoicing, in-person inspection), assumptions of higher value installed will be made\n - Installed lamps purchased at participating instant discount retailers disqualify the LPD measure\n - Choose Area Type(s) best describing the use of space\n - If \"Other-Identify\" is chosen, note on Start Here! Tab in \"Project Notes\"- The LPD calculation/incentive will be calculated upon review"]
[]
[]
[]
[]
[]
[]
[]
[]
["Area 1"]
["Type:","Choose from Drop-down",null,null,{"$f":"IFERROR(VLOOKUP(B11,Admin_Lists!$A$9:$B$49,2,FALSE),\"\")","v":0},null,"Example"]
[null,"Description & Sq. Ft. listed in Sq. Ft. Area Tab (Area 1):",{"$f":"'Sq. Ft. Area Individual Files'!D10","v":0},null,{"$f":"'Sq. Ft. Area Individual Files'!C11","v":0},null,"Type:","Warehouse",null,null,0.66]
["Fixture Mark","Fixture\nName","Fixture\nCount","Fixture Watts","Total\nWatts \n(Fixt Count \nx Fixt Watts)",null,"Fixture Mark","Fixture\nName","Fixture\nCount","Fixture Watts","Total\nWatts \n(Fixt Count \nx Fixt Watts)"]
[null,null,null,null,{"$f":"C14*D14","v":0},null,"HB","Lithonia High Bay IBG 240000 LM SEF AFL",4,150,{"$f":"I14*J14","v":600}]
[null,null,null,null,0,null,"SC","Lithonia CLX L96 6000LM SEF RDL ",10,49,490]
[null,null,null,null,0,null,"LS4.64","Lithonia Surface Mounted",251,55,13805]
[null,null,null,null,0,null,"LS4.47","Lithonia Surface Mounted",359,43,15437]
[null,null,null,null,0,null,"LS4.5","Lithonia Surface Mounted",1,43,43]
[null,null,null,null,0,null,"LSW4","GE Wall Mounted",2,48,96]
[null,null,null,null,{"$f":"D20*C20","v":0}]
{"$rows_left_out":199}
{"sheet":"Wattage Individual Files","index":7,"n_rows":11,"n_cols":1,"rows_kept":11,"cut":false,"hidden":true,"merged":[[0,0,8,10],[11,0,45,10]]}
["Documentation of Installed Fixture Wattage\n - Acceptable forms of wattage documentation: ENERGY STAR or DLC SSL QPL listings and/or Manufacturer's specs\n - If the project was not developed and overseen by a credentialed lighting professional (see Requirements tab for list of credentials),\n   then ALL lighting fixtures must be ENERGY STAR or DLC SSL QPL listed (TRT V5.0 or higher) *Note* If even one fixture is not ENERGY\n   STAR or DLC listed, the entire LPD measure is disqualified\n - Include multiple files if appropriate\n - Supply as separate document attachment(s) if file size is prohibitive\n - See Helpful Tips tab for help inserting files"]
[]
[]
[]
[]
[]
[]
[]
[]
[]
["Insert file(s) here:"]

{"sheet":"Invoices Individual Files","index":8,"n_rows":10,"n_cols":1,"rows_kept":10,"cut":false,"hidden":true,"merged":[[0,0,6,10],[10,0,44,10]]}
["Invoices to Support Fixtures Installed\n - Include invoices for all interior fixtures installed (indicate any items on invoice that are not part of the LPD offering)\n - Provide itemized invoices showing quantity and make/model number\n - Include multiple files if appropriate\n - Supply as separate document attachment(s) if file size is prohibitive\n - Installed lamps purchased at participating instant discount retailers disqualify the LPD measure\n - See Helpful Tips tab for help inserting files"]
[]
[]
[]
[]
[]
[]
[]
[]
["Insert invoice(s) here:"]

{"sheet":"Helpful Tips Individual Files","index":9,"n_rows":35,"n_cols":11,"rows_kept":35,"cut":false,"hidden":true,"merged":[]}
["Helpful Tips"]
[]
["How to Embed (insert) a PDF File in an Excel Worksheet",null,null,null,null,null,null,null,null,null,"1)"]
["1. Go to Insert tab and click on the Object icon in the Text group. ..."]
["2. In the Object dialog box, select the 'Create New' tab and the select 'Adobe Acrobat Document' from the list. ..."]
["3. Check the option – 'Display as icon'."]
["4. If desired, select \"Change Icon\" to modify the file name displayed (ex: Installation invoice, COMcheckv1, etc.).  "]
["5. Click OK."]
["6. Select the PDF file to embed and click on Open."]
[]
["How to Unhide rows in an Excel Worksheet"]
["1. Select the row above, and row below the hidden rows"]
[]
[]
[]
[]
[]
["2. Right click mouse button",null,null,null,null,null,null,null,null,null,"2-4)"]
["3. Select Unhide from menu"]
[]
{"$rows_left_out":16}
{"sheet":"RevisionHistory","index":10,"n_rows":14,"n_cols":4,"rows_kept":14,"cut":false,"hidden":true,"merged":[]}
[]
[]
["Version History"]
["Program Year","Date of Revision","Description of Changes","Updated By:"]
[2021,"2021-01-01","Initial version"]
[2021,"2021-02-27","Added Tech Review calc, SPECTRUM entry, checklist. Fixed rounding errors. Added \"area description\" on individual files tab. Fixed protection to allow inserting pages","Trish"]
[2021,"2021-03-02","Corrected rounding issues on Start Here! Tab in columns J and H and R thru Y in savings table","Melissa"]
[2021,"2021-03-18","Changed algorithms in cells S4-S47 to reference only one cell for CF lookup. Also, removed colon (\":\") at the end of the facility type names (cells J14-J19) to aide proper lookup for CF","Zishan"]
[2021,"2021-03-25","Removed ROUNDDOWN function and added ROUND to cells H23-H27, J23-J27, R42-R47 and W42-W47 in \"Start Here!\" tab. Also added ROUND function to round allowed watts in \"As-Built COMcheck\" tab","Zishan"]
[2021,"2021-03-26","Added algorithm to correctly pull CF in O38"]
[2021,"2021-03-26","Conditional format HOU on Start Here tab. Add LPD reference table on As-Built COMcheck tab. Add note about more than 5 area types on As-Built COMcheck tab. Formatted Indiv. Files Sq Ft by area to be reflected on Fixt List tab.","Trish"]
[2021,"2021-04-07","Added 'qualify the project' section to Start here tab","Trish"]
[2021,"2021-04-12","Added \"Annual\" to Hours of use in sds table. Revised formatting of lines on COMcheck tab, and added consistent verbiage to \"more than 5 areas topic\" on COMcheck tab. Updated the utility $/therm, #/kWh to 2019","Trish"]
[2021,"2021-05-17","added additional credentialed lighting professionals to list on Start Here tab, and updated the pictures of catalog pg. on the Requirements tabs (Ind. Files + COMcheck)","Trish"]

{"sheet":"Helpful Tips COMcheck","index":11,"n_rows":33,"n_cols":11,"rows_kept":33,"cut":false,"hidden":true,"merged":[]}
["Helpful Tips"]
[]
["How to Embed a PDF File in an Excel Worksheet",null,null,null,null,null,null,null,null,null,"1)"]
["1. Go to Insert tab and click on the Object icon in the Text group. ..."]
["2. In the Object dialog box, select the 'Create New' tab and the select 'Adobe Acrobat Document' from the list. ..."]
["3. Check the option – 'Display as icon'."]
["4. If desired, select \"Change Icon\" to modify the file name displayed (ex: Installation invoice, COMcheckv1, etc.).  "]
["5. Click OK."]
["6. Select the PDF file to embed and click on Open."]
[]
["How to Unhide rows in an Excel Worksheet"]
["1. Select the row above, and row below the hidden rows"]
[]
[]
[]
[]
[]
["2. Right click mouse button",null,null,null,null,null,null,null,null,null,"2-4)"]
["3. Select Unhide from menu"]
[]
{"$rows_left_out":14}
{"sheet":"Admin_Lists","index":12,"n_rows":107,"n_cols":15,"rows_kept":107,"cut":false,"hidden":true,"merged":[[8,14,9,15],[51,0,52,0],[6,0,7,1]]}
[]
[null,"Type"]
[null,"Choose from Drop-down",null,"<==The items in this list are named ComCheck"]
[null,"COMcheck",null,"To name the data cells, select them, click in the Name Box"]
[null,"Individual Files",null,"Add more words to the list, and the list will expand to include them"]
[]
["LIGHTING POWER DENSITY\n(AREA METHOD)",null,null,null,null,null,null,"Space by Space Reference for Tech Review, not part of drop-down options"]
[null,null,null,null,null,null,null,"Common & Specific Space Types",null,null,null,null,"(W/ft2)"]
["Choose from Drop-down",0,null,null,null,null,null,"Atrium - greater than 40 ft. in height",null,null,null,null,0.4," 0.40+.02/ft in total height","Ceiling Height\n(If Applicable)  "]
["Automotive Facility",0.8,null,null,null,null,null,"Atrium - less than 40 ft. in height",null,null,null,null,0.03,"0.03/ft in total height"]
["Convention Center",1.01,null,null,null,null,null,"Audience Seating Area - in a convention center",null,null,null,null,0.82]
["Court House",1.01,null,null,null,null,null,"Audience Seating Area - in a gymnasium",null,null,null,null,0.65]
["Dining: Bar Lounge/Leisure",1.01,null,null,null,null,null,"Audience Seating Area - in a motion picture theatre",null,null,null,null,1.1399999999999999]
["Dining: Cafeteria/Fast Food",0.9,null,null,null,null,null,"Audience Seating Area - in a penitentiary",null,null,null,null,0.28000000000000003]
["Dining: Family",0.95,null,null,null,null,null,"Audience Seating Area - in a performing arts theatre",null,null,null,null,2.4300000000000002]
["Dormitory",0.56999999999999995,null,null,null,null,null,"Audience Seating Area - in a religious building ",null,null,null,null,1.53]
["Exercise Center",0.84,null,null,null,null,null,"Audience Seating Area - in a sports arena",null,null,null,null,0.43]
["Fire Station",0.67,null,null,null,null,null,"Audience Seating Area - in an auditorium",null,null,null,null,0.63]
["Free Stall",0.5,null,null,null,null,null,"Audience Seating Area - otherwise",null,null,null,null,0.43]
["General Animal Care Area, Utility Room",0.5,null,null,null,null,null,"Automotive (see Vehicular Maintenance Area above)",null,null,null,null,0.67]
{"$rows_left_out":87}