{"text_format":"3","workbook":"xlsx","n_sheets":10,"sheets":["Start Here!"," Requirements COMcheck","As-Built COMcheck"," Requirements Individual Files","Sq. Ft. Area Individual Files","Fixture List Individual Files","FixturesByArea Individual Files","Helpful Tips","RevisionHistory","Admin_Lists"],"not_rendered":{"images":13,"macros":1,"defined_names":29,"comments":3},"read":"whole","date_system":"1900"}

{"sheet":"Start Here!","index":0,"n_rows":106,"n_cols":33,"rows_kept":106,"merged":[[0,1,3,3],[4,1,4,11],[6,1,15,11],[6,14,6,15],[6,17,6,18],[17,1,17,2],[18,1,18,10],[19,3,19,11],[20,2,20,10],[20,15,20,18],[21,3,21,11],[21,15,21,18],[22,2,22,10],[22,15,22,18],[23,3,23,11],[23,15,24,18],[23,19,24,19],[24,2,24,10],[25,3,25,11],[25,15,25,18],[26,1,26,11],[26,15,27,18],[26,19,27,19],[27,1,27,2],[27,3,27,11],[28,1,28,2],[28,3,28,11],[28,15,29,18],[28,19,29,19],[29,1,29,2],[29,3,29,5],[29,7,29,8],[29,10,29,11],[30,1,30,2],[30,3,30,11],[30,15,30,18],[31,1,31,2],[31,3,31,11],[31,15,31,18],[32,1,32,2],[32,3,32,11],[32,15,32,18],[34,9,34,11],[35,9,35,10],[36,6,36,7],[36,9,36,10],[37,6,38,7],[37,9,37,10],[38,9,38,10],[39,6,41,7],[39,9,39,10],[40,9,40,11],[43,2,43,11],[72,1,73,1],[78,2,78,11]]}
[null,"Note: this workbook needs to be used in the full version of Excel. Some features won't work in Excel Online. Also, make sure that macros are enabled when you open this workbook (see 'Helpful Tips' tab for directions).",{"$nulls":11},"Hide","Hide","Hide","Hide","Hide","Hide","Hide","Hide","Hide","Hide","Hide","Hide","Hide","Hide","Hide","Hide","Hide","Hide","Hide","Hide"]
[]
[]
[]
[null,"New Construction Interior Lighting Supplemental Workbook"]
[]
[null,"Required documentation (COMcheck, floorplan and/or lighting layout) must be signed by a lighting professional with one or more of the following credentials:\n • Lighting Certification (LC) designation from National Council on Qualifications for the Lighting Professions (NCQLP)\n • Certified Lighting Efficiency Professional (CLEP) from the Association of Energy Engineers (AEE)\n • Certified Lighting Management Consultant (CLMC)\n • State of Wisconsin Professional Engineer (PE) License\n • Member of International Association of Lighting Designers (IALD)\n • Lighting Specialist II certification from National Association of Innovative Lighting Distributors (NAILD)\n • Commercial and Industrial Lighting Certificate form the Illuminating Engineering Society of America (IES)\n • Registered designer of electrical engineering systems in the state of Wisconsin\n • Member of the Institute of Electrical and Electronics Engineers (IEEE)\n • Other credential approved by Focus on Energy",{"$nulls":12},"SPECTRUM entry:",null,null,"SPECTRUM entry (NLC Savings):"]
[{"$nulls":14},"Unit of Measure Answer",{"$f":"X71","v":0},"net KWh reduced all areas","Unit of Measure Answer",{"$f":"'FixturesByArea Individual Files'!N1091","v":0},"net KWh reduced all areas"]
[{"$nulls":14},"Units",1,null,"Units",1,{"$nulls":6},"Provide\nAS BUILT:","Possible ways to provide it:"]
[{"$nulls":14},"Measure Cost",{"$f":"Z71","v":0},{"$f":"\"$\" & FIXED(LPD_IndustryStandardCostPerSqFt,2) & \"*sq. ft. or Tech Review override (manual entry)\"","v":"$0.90*sq. ft. or Tech Review override (manual entry)"},"Measure Cost",{"$f":"0.57*SUM(C46:C70)*'FixturesByArea Individual Files'!M1093","v":0},"=Measure cost for just NLC based on NLC area factor",{"$nulls":5},"Sq Ft","COMcheck","Layout","Schedule","Submittal","Email","QPL snip"]
[{"$nulls":25},"Wattage ","COMcheck","Layout","Schedule","Submittal","Email","QPL snip"]
[{"$nulls":14},"kW Savings (Peak)",{"$f":"T71","v":{"v":0,"d":"0.0000"}},"net savings all areas","kW Savings (Peak)",{"$f":"'FixturesByArea Individual Files'!M1091","v":{"v":0,"d":"0.0000"}},"net savings all areas",{"$nulls":5},"Fixture list","COMcheck","Layout","Schedule","Submittal","Email","QPL snip"]
[{"$nulls":14},"kWh Savings (1st Yr)",{"$f":"X71","v":0},"net savings all areas","kWh Savings (1st Yr)",{"$f":"'FixturesByArea Individual Files'!N1091","v":0},"net savings all areas",{"$nulls":5},"Pro Sign-off","COMcheck","Layout","Schedule","Submittal","Email","QPL snip"]
[{"$nulls":14},"kWh Savings (Lifecycle)",{"$f":"Y71","v":0},"net savings all areas","kWh Savings (Lifecycle)",{"$f":"'FixturesByArea Individual Files'!O1091","v":0},"net savings all areas",{"$nulls":5},"Invoice","COMcheck","Layout","Schedule","Submittal","Email","QPL snip"]
[{"$nulls":26},"COMcheck","Layout","Schedule","Submittal","Email","QPL snip"]
{"$rows_left_out":92}
{"sheet":" Requirements COMcheck","index":1,"n_rows":0,"n_cols":0,"rows_kept":0,"hidden":true}

{"sheet":"As-Built COMcheck","index":2,"n_rows":176,"n_cols":26,"rows_kept":176,"hidden":true,"merged":[[0,0,5,10],[0,11,0,20],[1,11,2,20],[3,11,4,20],[5,11,5,20],[11,4,12,9],[11,13,11,22],[16,13,18,24],[19,13,20,24],[21,13,22,24],[24,13,28,24],[36,25,36,26],[38,25,38,26],[135,13,136,19],[137,0,149,10],[152,0,171,10]]}
["For data provided via COMcheck report\n - Provide the As-Built COMcheck report signed by a credentialed lighting professional\n       See Requirements tab for list of accepted credentials\n       If the COMcheck is not signed, go to Start Here tab and choose \"Individual Files\" from drop-down\n - If COMcheck lists more than 5 Area Types, contact Focus on Energy for assistance (business@focusonenergy.com)\n - See Helpful Tips tab for directions on inserting files",{"$nulls":10},"Invoices to Support Fixtures Installed"]
[{"$nulls":11}," - Include invoices for all interior fixtures installed (indicate any items \n   on invoice that are not part of the LPD offering)"]
[]
[{"$nulls":11}," - Provide itemized invoices showing quantity and make/model number\n - Include multiple files if appropriate"]
[]
[{"$nulls":11}," - Supply as separate document attachment(s) if file size is prohibitive"]
[]
[]
["Area 1:",null,"Total Sq. Ft:",null,"Found on COMcheck as \"Floor Area (ft2)\""]
[null,null,"Allowed Watts/ft2:",null,"Found on COMcheck as \"Allowed Watts / ft2\""]
[null,null,"Total Allowed Watts:",{"$f":"IFERROR(ROUND(D9*D10,0),\"\")","v":0},"This will calculate"]
[null,null,"New System Installed Watts:",null,"For Single Area Facility find on COMcheck as Total Proposed\nWatts - For multi-area add all wattage installed in Area 1 ",{"$nulls":8},"Important Reminders for COMcheck Reports"]
[{"$nulls":13},"Must use Energy Code \"2015 IECC\""]
["Lines 15-33 used if multiple area types are listed on COMcheck, as indicated under \"Area Category\""]
[]
{"$rows_left_out":162}
{"sheet":" Requirements Individual Files","index":3,"n_rows":0,"n_cols":0,"rows_kept":0,"hidden":true}

{"sheet":"Sq. Ft. Area Individual Files","index":4,"n_rows":35,"n_cols":16,"rows_kept":35,"hidden":true,"merged":[[0,0,6,5],[9,12,10,16],[11,12,16,16],[19,14,20,14]]}
["Documentation Showing As-Built Square Footage\n - Building Plans must be signed by credentialed lighting professional \n      See Requirements tab for list of accepted credentials\n - Floorplan layout must include dimensions\n - Include multiple files if appropriate\n - Supply as separate document attachment(s) if file size is prohibitive\n - See Helpful Tips tab for help inserting files"]
{"$rows_empty":7}
[null,null,"Sq. Ft.","Describe Area",null,"Insert floorplan PDF(s) here:"]
[null,null,"The value entered will be verified on the floorplan layout"," (ex.: Warehouse, Offices, etc.)",{"$nulls":8},"For Projects with Multiple Area Use Types\n   Ex.: Warehouse (Area 1), Showroom (Area 2) and Offices (Area 3) within same facility\n"]
[null,"Area 1:"]
[null,"Area 2:",{"$nulls":10},"1. Enter description of each Area\n2. Combine all of facility's common Use Type Areas within one area calculation\n       Example: Office spaces on Floor 1 (956 sq. ft.) + Floor 2 (5,110 sq. ft.) + Floor 3 \n       (554 sq. ft.) = 6,620 sq. ft. for the \"office\" area type \n3. Be sure all area types are clearly marked on building layout pdf "]
[null,"Area 3:"]
[null,"Area 4:"]
[null,"Area 5:"]
[null,"Area 6:"]
[null,"Area 7:"]
[null,"Area 8:"]
[null,"Area 9:",{"$nulls":10},"Example:",null,"Sq. Ft.","Describe Area"]
[null,"Area 10:",{"$nulls":12},"The value entered will be verified on the pdf layout"]
[null,"Area 11:",{"$nulls":13}," (ex.: Warehouse, Offices, etc.):"]
{"$rows_left_out":15}
{"sheet":"Fixture List Individual Files","index":5,"n_rows":63,"n_cols":19,"rows_kept":63,"hidden":true,"merged":[[0,7,0,11],[1,1,1,6],[1,7,2,11],[2,1,2,6],[3,1,3,6],[3,7,3,11],[4,1,4,6],[4,7,4,11],[5,7,5,11],[6,1,6,6],[6,7,6,11],[7,1,7,6],[7,7,10,11],[8,1,8,6],[9,1,9,6],[10,1,10,6],[11,14,11,18]]}
["List of ALL Interior fixtures installed, along with documentation of installed fixture wattage. ",{"$nulls":6},"Invoices to Support Fixtures Installed"]
["-","Acceptable forms of wattage documentation: ENERGY STAR or DLC SSL QPL listings and/or Manufacturer's specs.",{"$nulls":5}," - Include invoices for all interior fixtures installed (indicate any items \n   on invoice that are not part of the LPD offering)"]
["-","Do not include Exterior fixtures, or emergency / exit lights.\n"]
["-","If the project was NOT developed and overseen by a credentialed lighting professional (see Requirements tab for accepted credentials), then ALL lighting fixtures must be ENERGY STAR® or DLC SSL QPL listed (TRT V5.1 or higher). ",{"$nulls":5}," - Provide itemized invoices showing quantity and make/model number\n - Include multiple files if appropriate"]
[null,"          *Note* If even one fixture is not ENERGY STAR or DLC listed, the entire LPD measure is disqualified.",{"$nulls":5}," - Supply as separate document attachment(s) if file size is prohibitive"]
["-","For fixture wattage, enter wattage to 1 or 2 decimals, however it is shown on the spec sheet. "]
["-","All data should be per As-Built conditions. If discrepancies are found in review (fixtures listed, invoicing, in-person inspection), \nwill use higher value.",{"$nulls":5},"Insert shared spec sheet, DLC/ENERGY STAR, and Invoice PDFs here:"]
["-","Installed lamps purchased at participating instant discount retailers disqualify the LPD measure."]
["-","For NLC - Industrial, School and Goverment customer installing NLC in high bay spaces and/or spaces requiring daylighting controls are not eligible for NLC incentives (N-L5233); NLC installed in other spaces are still eligible."]
["-","If the fixture has NLC controls, check yes in column E and then select a Space Type in column F. Use a separate Fixture Mark to denote fixtures with and without NLC controls. "]
["-","See Helpful Tips tab for help inserting files"]
[{"$nulls":14},"Example"]
[null,"Fixture Mark","Fixture Name","Fixture Watts","Has NLC Controls (Yes/No)","Space type","Spec Sheet","DLC or ENERGY STAR Listing (If Applicable)","Invoice","Total Fixture Count (All Spaces)",{"$nulls":4},"Fixture Mark","Fixture\nName",null,"Fixture Watts","Fixture\nCount"]
[{"$nulls":5},"Choose from Drop-down",{"$nulls":3},{"$f":"SUMIF('FixturesByArea Individual Files'!$A$14:$A$1083,B14,'FixturesByArea Individual Files'!$C$14:$C$1083)","v":0},{"$nulls":4},"HB","Lithonia High Bay IBG 24000 LM SEF AFL",null,150,4]
[{"$nulls":5},"Choose from Drop-down",{"$nulls":3},{"$f":"SUMIF('FixturesByArea Individual Files'!$A$14:$A$1083,B15,'FixturesByArea Individual Files'!$C$14:$C$1083)","v":0},{"$nulls":4},"SC","Lithonia CLX L96 6000LM SEF RDL ",null,49,10]
{"$rows_left_out":49}
{"sheet":"FixturesByArea Individual Files","index":6,"n_rows":1093,"n_cols":19,"rows_kept":1093,"hidden":true,"merged":[[0,0,0,9],[1,1,1,9],[2,1,2,9],[3,1,3,9],[4,1,4,9],[5,1,5,9],[6,1,6,9],[7,1,7,9],[10,0,10,4],[12,1,12,4],[12,14,12,18],[13,0,14,0],[13,1,14,1],[13,2,14,2],[13,3,14,3],[13,4,14,4],[13,5,14,5],[13,6,14,6],[13,7,13,9],[53,0,53,4],[55,1,55,4],[56,0,57,0],[56,1,57,1],[56,2,57,2],[56,3,57,3],[56,4,57,4],[56,5,57,5],[56,6,57,6],[56,7,56,9],[96,0,96,4],[98,1,98,4],[99,0,100,0],[99,1,100,1],[99,2,100,2],[99,3,100,3],[99,4,100,4],[99,5,100,5],[99,6,100,6],[99,7,99,9],[139,0,139,4],[141,1,141,4],[142,0,143,0],[142,1,143,1],[142,2,143,2],[142,3,143,3],[142,4,143,4],[142,5,143,5],[142,6,143,6],[142,7,142,9],[182,0,182,4],[184,1,184,4],[185,0,186,0],[185,1,186,1],[185,2,186,2],[185,3,186,3],[185,4,186,4],[185,5,186,5],[185,6,186,6],[185,7,185,9],[225,0,225,4],[227,1,227,4],[228,0,229,0],[228,1,229,1],[228,2,229,2],[228,3,229,3],[228,4,229,4],[228,5,229,5],[228,6,229,6],[228,7,228,9],[268,0,268,4],[270,1,270,4],[271,0,272,0],[271,1,272,1],[271,2,272,2],[271,3,272,3],[271,4,272,4],[271,5,272,5],[271,6,272,6],[271,7,271,9],[311,0,311,4],[313,1,313,4],[314,0,315,0],[314,1,315,1],[314,2,315,2],[314,3,315,3],[314,4,315,4],[314,5,315,5],[314,6,315,6],[314,7,314,9],[354,0,354,4],[356,1,356,4],[357,0,358,0],[357,1,358,1],[357,2,358,2],[357,3,358,3],[357,4,358,4],[357,5,358,5],[357,6,358,6],[357,7,357,9],[397,0,397,4],[399,1,399,4],[400,0,401,0],[400,1,401,1],[400,2,401,2],[400,3,401,3],[400,4,401,4],[400,5,401,5],[400,6,401,6],[400,7,400,9],[440,0,440,4],[442,1,442,4],[443,0,444,0],[443,1,444,1],[443,2,444,2],[443,3,444,3],[443,4,444,4],[443,5,444,5],[443,6,444,6],[443,7,443,9],[483,0,483,4],[485,1,485,4],[486,0,487,0],[486,1,487,1],[486,2,487,2],[486,3,487,3],[486,4,487,4],[486,5,487,5],[486,6,487,6],[486,7,486,9],[526,0,526,4],[528,1,528,4],[529,0,530,0],[529,1,530,1],[529,2,530,2],[529,3,530,3],[529,4,530,4],[529,5,530,5],[529,6,530,6],[529,7,529,9],[569,0,569,4],[571,1,571,4],[572,0,573,0],[572,1,573,1],[572,2,573,2],[572,3,573,3],[572,4,573,4],[572,5,573,5],[572,6,573,6],[572,7,572,9],[612,0,612,4],[614,1,614,4],[615,0,616,0],[615,1,616,1],[615,2,616,2],[615,3,616,3],[615,4,616,4],[615,5,616,5],[615,6,616,6],[615,7,615,9],[655,0,655,4],[657,1,657,4],[658,0,659,0],[658,1,659,1],[658,2,659,2],[658,3,659,3],[658,4,659,4],[658,5,659,5],[658,6,659,6],[658,7,658,9],[698,0,698,4],[700,1,700,4],[701,0,702,0],[701,1,702,1],[701,2,702,2],[701,3,702,3],[701,4,702,4],[701,5,702,5],[701,6,702,6],[701,7,701,9],[741,0,741,4],[743,1,743,4],[744,0,745,0],[744,1,745,1],[744,2,745,2],[744,3,745,3],[744,4,745,4],[744,5,745,5],[744,6,745,6],[744,7,744,9],[784,0,784,4],[786,1,786,4],[787,0,788,0],[787,1,788,1],[787,2,788,2],[787,3,788,3],[787,4,788,4],[787,5,788,5],[787,6,788,6],[787,7,787,9],[827,0,827,4],[829,1,829,4],[830,0,831,0],[830,1,831,1],[830,2,831,2],[830,3,831,3],[830,4,831,4],[830,5,831,5],[830,6,831,6],[830,7,830,9],[870,0,870,4],[872,1,872,4],[873,0,874,0],[873,1,874,1],[873,2,874,2],[873,3,874,3],[873,4,874,4],[873,5,874,5],[873,6,874,6],[873,7,873,9],[913,0,913,4],[915,1,915,4],[916,0,917,0],[916,1,917,1],[916,2,917,2],[916,3,917,3],[916,4,917,4],[916,5,917,5],[916,6,917,6],[916,7,916,9],[956,0,956,4],[958,1,958,4],[959,0,960,0],[959,1,960,1],[959,2,960,2],[959,3,960,3],[959,4,960,4],[959,5,960,5],[959,6,960,6],[959,7,959,9],[999,0,999,4],[1001,1,1001,4],[1002,0,1003,0],[1002,1,1003,1],[1002,2,1003,2],[1002,3,1003,3],[1002,4,1003,4],[1002,5,1003,5],[1002,6,1003,6],[1002,7,1002,9],[1042,0,1042,4],[1044,1,1044,4],[1046,0,1047,0],[1046,1,1047,1],[1046,2,1047,2],[1046,3,1047,3],[1046,4,1047,4],[1046,5,1047,5],[1046,6,1047,6],[1046,7,1046,9],[1088,12,1088,15]]}
["List of ALL Interior fixtures (including quantity) in the area(s) where they were installed. "]
["-","Do not include Exterior fixtures, or emergency / exit lights."]
["-","If the project was NOT developed and overseen by a credentialed lighting professional (see Requirements tab for accepted credentials), then ALL lighting fixtures must be ENERGY STAR® or DLC SSL QPL listed (TRT V5.1 or higher)."]
[null,"          *Note* If even one fixture is not ENERGY STAR or DLC listed, the entire LPD measure is disqualified."]
["-","All data should be per As-Built conditions. If discrepancies are found in review (fixtures listed, invoicing, in-person inspection), will use higher value."]
["-","Choose Area Type(s) best describing the use of space."]
["-","If \"Other-Identify\" is chosen, note on Start Here! Tab in \"Project Notes\"- The LPD calculation/incentive will be calculated upon review."]
["-","For NLC - Industrial, School and Goverment customer installing NLC in high bay spaces and/or spaces requiring daylighting controls are not eligible for NLC incentives (N-L5233); NLC installed in other spaces are still eligible."]
[]
[]
["Area 1",{"$nulls":4},"NLC area factor:",{"$nulls":3},{"$f":"IF(VLOOKUP(A11,'Start Here!'!$N$46:$Q$70,4,FALSE)=0,VLOOKUP(Facility_Type,Admin_Lists!$A$63:$B$66,2,FALSE),VLOOKUP(A11,'Start Here!'!$N$46:$Q$70,4,FALSE))","v":{"$error":"#N/A"}}]
["Type:",{"$nulls":3},{"$f":"IFERROR(VLOOKUP(B12,Admin_Lists!$A$9:$B$49,2,FALSE),\"\")","v":""},"W/sq ft",{"$nulls":3},{"$f":"VLOOKUP(A11,'Start Here!'!$N$46:$O$70,2,FALSE)","v":0}]
[null,{"$f":"\"Area Description: \"&'Sq. Ft. Area Individual Files'!D11","v":"Area Description: "},{"$nulls":3},"Sq Ft: ",{"$f":"'Sq. Ft. Area Individual Files'!C11","v":{"v":0,"d":"0 "}},{"$nulls":7},"Example"]
["Fixture Mark","Fixture\nName","Fixture\nCount","Fixture Watts","Total Watts \n(Fixt Count \nx Fixt Watts)","NLC Controls (Yes/No)","Space type","NLC Controls Savings",{"$nulls":6},"Type:","Warehouse",null,null,0.66]
[{"$nulls":7},"Peak kW Savings","Annual kWh Savings","LC kWh Savings",{"$nulls":4},"Fixture Mark","Fixture\nName","Fixture\nCount","Fixture Watts","Total Watts \n(Fixt Count \nx Fixt Watts)"]
{"$rows_left_out":1079}
{"sheet":"Helpful Tips","index":7,"n_rows":43,"n_cols":11,"rows_kept":43}
["Helpful Tips"]
[]
["How to Enable Macros"]
["1. When you open the workbook, look just above the formula bar for a yellow shaded row that looks like this: "]
["2. If this appears, click the \"Enable Content\" button"]
["3. Generally, should only have to do this the first time you open the workbook. If you download a new copy from "]
["    the Focus website or have additional staff access the workbook, will likely need to do this again. "]
[]
[]
[]
["How to Embed (insert) a PDF File in an Excel Worksheet",{"$nulls":9},"1)"]
["1. Go to Insert tab and click on the Object icon in the Text group. ..."]
["2. In the Object dialog box, select the 'Create New' tab and the select 'Adobe Acrobat Document' from the list. ..."]
["3. Check the option – 'Display as icon'."]
["4. If desired, select \"Change Icon\" to modify the file name displayed (ex: Installation invoice, COMcheckv1, etc.).  "]
{"$rows_left_out":18}
{"sheet":"RevisionHistory","index":8,"n_rows":27,"n_cols":4,"rows_kept":27,"hidden":true}
[]
[]
["Version History"]
["Program Year","Date of Revision","Description of Changes","Updated By:"]
[2021,"2021-01-01","Initial version"]
[2021,"2021-02-27","Added Tech Review calc, SPECTRUM entry, checklist. Fixed rounding errors. Added \"area description\" on individual files tab. Fixed protection to allow inserting pages","Trish"]
[2021,"2021-03-02","Corrected rounding issues on Start Here! Tab in columns J and H and R thru Y in savings table","Melissa"]
[2021,"2021-03-18","Changed algorithms in cells S4-S47 to reference only one cell for CF lookup. Also, removed colon (\":\") at the end of the facility type names (cells J14-J19) to aide proper lookup for CF","Zishan"]
[2021,"2021-03-25","Removed ROUNDDOWN function and added ROUND to cells H23-H27, J23-J27, R42-R47 and W42-W47 in \"Start Here!\" tab. Also added ROUND function to round allowed watts in \"As-Built COMcheck\" tab","Zishan"]
[2021,"2021-03-26","Added algorithm to correctly pull CF in O38"]
[2021,"2021-03-26","Conditional format HOU on Start Here tab. Add LPD reference table on As-Built COMcheck tab. Add note about more than 5 area types on As-Built COMcheck tab. Formatted Indiv. Files Sq Ft by area to be reflected on Fixt List tab.","Trish"]
[2021,"2021-04-07","Added 'qualify the project' section to Start here tab","Trish"]
[2021,"2021-04-12","Added \"Annual\" to Hours of use in sds table. Revised formatting of lines on COMcheck tab, and added consistent verbiage to \"more than 5 areas topic\" on COMcheck tab. Updated the utility $/therm, #/kWh to 2019","Trish"]
[2021,"2021-05-17","Corrected units for kWh (annual and lifecycle) on Start Here! tab summary table ","Todd"]
[2021,"2021-07-19","Updated list of credentials for lighting designers","Melissa"]
{"$rows_left_out":13}
{"sheet":"Admin_Lists","index":9,"n_rows":107,"n_cols":15,"rows_kept":107,"hidden":true,"merged":[[6,0,7,1],[8,14,9,15],[51,0,52,0]]}
[]
[null,"Type"]
[null,"Choose from Drop-down",null,"<==The items in this list are named ComCheck"]
[null,"COMcheck",null,"To name the data cells, select them, click in the Name Box"]
[null,"Individual Files",null,"Add more words to the list, and the list will expand to include them"]
[]
["LIGHTING POWER DENSITY\n(AREA METHOD)",{"$nulls":6},"Space by Space Reference for Tech Review, not part of drop-down options"]
[{"$nulls":7},"Common & Specific Space Types",{"$nulls":4},"(W/ft2)"]
["Choose from Drop-down",0,{"$nulls":5},"Atrium - greater than 40 ft. in height",{"$nulls":4},{"v":0.4,"d":"0.40"}," 0.40+.02/ft in total height","Ceiling Height\n(If Applicable)  "]
["Automotive Facility",0.8,{"$nulls":5},"Atrium - less than 40 ft. in height",{"$nulls":4},0.03,"0.03/ft in total height"]
["Convention Center",1.01,{"$nulls":5},"Audience Seating Area - in a convention center",{"$nulls":4},0.82]
["Court House",1.01,{"$nulls":5},"Audience Seating Area - in a gymnasium",{"$nulls":4},0.65]
["Dining: Bar Lounge/Leisure",1.01,{"$nulls":5},"Audience Seating Area - in a motion picture theatre",{"$nulls":4},1.14]
["Dining: Cafeteria/Fast Food",0.9,{"$nulls":5},"Audience Seating Area - in a penitentiary",{"$nulls":4},0.28]
["Dining: Family",0.95,{"$nulls":5},"Audience Seating Area - in a performing arts theatre",{"$nulls":4},2.43]
{"$rows_left_out":92}