{"text_format":"3","workbook":"xlsx","n_sheets":6,"sheets":["Version History","Application","Calculations","QPLs","Invoice_Optional","Savings and Incentives"],"not_rendered":{"images":5,"macros":1,"external_links":1,"defined_names":91,"comments":3},"read":"whole","date_system":"1900"}

{"sheet":"Version History","index":0,"n_rows":21,"n_cols":4,"rows_kept":21,"hidden":true}
["2021 Comprehensive Lighting Solutions Workbook"]
[]
["Version History"]
["Program Year","Date of Revision","Description of Changes","Updated By:"]
[2020,"2020-07-09","On Savings and Incentive tab, remove $/kWh and fix MMID 5029 final incentive to cap at 50% of project cost. Round / adjust HID lighting options to match Page 41 of Lighting Catalog. ","Melissa"]
[2020,"2020-07-10","Correct R4758 to be per kW controlled (not per motor) and kitchen demand control ventilation measures to require tech review. ","Zach"]
[2020,"2020-11-20","Corrected formula in column Z on the calc tab to reference $E$9 and $G$10 instead of E9 and G10","Melissa"]
[2020,"2020-12-23","Updated exterior control savings factor from 0.4 to 0.5 per approved workpaper in Huddle","Melissa"]
[2020,"2020-12-23","Updated the Application tab to reflect what the catalog application page will look like for 2021","Jeremiah"]
[2020,"2020-12-29","Changed password for protecting sheets to 'focus 2021'; changed # of rows options to 10/50/300/1000; updated 2021 Incentives header","Melissa/Zach"]
[2020,"2020-12-30","Removed '2020 CLS Sell Sheet' that was embedded on Savings and Incentives tab","Melissa"]
[2021,"2021-03-18","Added conditional formatting and an error message to prevent existing hours from being edited if the Annual Run Hours is set to \"Default Sector Hours\".","Zach"]
[2021,"2021-12-22","Removed Project Cost from Calc tab because it is redundant; updated all passwords for 2022","Melissa"]
[2022,"2022-01-03","Added '(either measured or calculated)' on Savings and Incentives tab under footcandles entry; Changed 'MMID' to 'Incentive' on Calc tab cell AC19","Melissa"]
[2022,"2022-01-04","Updated the application tab to have text align with check boxes and reflect changes to 2022 catalog.","Jeremiah"]
[2022,"2022-01-06","Added instruction on how to embed docs on QPL tab","Melissa"]
[2022,"2022-02-22","Unlocked the FEIN cell in the Application tab to allow users to input FEIN. Also, unlocked cell L63 to allow user to enter other type of business classification.","Zishan"]
[2022,"2022-04-01","Added Estimated Annual Cost Savings and Simple Payback w/ and w/o Incentive table to Savings and Incentives tab","Melissa"]
[2022,"2022-09-19","Updated Savings Factors to match updated workpaper for 2023 projects. Updated kW savings formula to include SF values","Melissa"]
[2022,"2022-10-28","Updated default elec rates and added sumif formula to project cost cells on Savings & Incentives tab to refer to Calculations tab; updated password for 2023","Melissa"]
[2022,"2022-12-22","Updated Application tab to reflect changes coming in the 2023 catalog; changed logo on Savings and Incentives page.","Jeremiah"]

{"sheet":"Application","index":1,"n_rows":64,"n_cols":13,"rows_kept":64,"merged":[[0,0,3,8],[0,9,3,13],[5,0,8,7],[10,0,10,2],[10,8,10,10],[12,0,12,3],[12,8,12,12],[13,0,15,6],[14,8,14,9],[14,10,14,12],[16,0,16,3],[16,4,16,6],[16,8,16,12],[17,4,17,6],[18,8,18,12],[20,8,20,10],[23,8,23,10],[24,1,24,5],[26,0,26,5],[28,0,28,5],[30,0,30,5],[30,11,30,12],[32,0,32,3],[32,9,32,10],[33,9,33,10],[33,11,33,12],[34,0,34,5],[34,8,34,12],[36,4,36,5],[36,8,36,12],[37,0,37,2],[38,8,38,10],[40,0,40,5],[40,8,40,12],[42,0,42,3],[42,4,42,5],[42,8,42,10],[44,0,44,3],[44,4,44,5],[45,8,45,10],[46,8,48,12],[49,0,49,5],[50,8,50,12],[51,0,51,3],[52,8,52,10],[54,0,54,2],[54,8,54,9],[54,11,54,12],[55,11,55,12],[56,0,56,5],[56,11,56,12],[57,9,57,11],[58,0,58,1],[58,2,58,5],[58,8,58,9],[59,8,59,12],[63,3,63,5]]}
["COMPREHENSIVE LIGHTING SOLUTION APPLICATION                                                                                                        FOR PROJECTS COMPLETED BY 12/31/2023",{"$nulls":8},"Note: this workbook needs to be used in the full version of Excel. Some features won't work in Excel Online."]
[]
[]
[]
[]
["COMPLETE ALL SECTIONS. INCOMPLETE APPLICATIONS CANNOT BE PROCESSED AND WILL DELAY PAYMENT OF INCENTIVES. APPLICATIONS MUST BE SUBMITTED WITHIN 60 DAYS OF COMPLETED PROJECT INSTALLATION, NO LATER THAN JANUARY 31, 2024. FOR ADDITIONAL COPIES OF THIS FORM, VISIT FOCUSONENERGY.COM/CATALOGS."]
[]
[]
[]
[]
["section 1",{"$nulls":7},"section 4"]
["ACCOUNT AND CUSTOMER INFORMATION",{"$nulls":7},"TRADE ALLY INFORMATION"]
["TAX IDENTIFICATION NUMBER (Check one.) ",{"$nulls":3},"       FEIN     or","           SSN"]
["IF YOU USE A SOCIAL SECURITY NUMBER (SSN) AS YOUR TAX IDENTIFICATION NUMBER, DO NOT PROVIDE IT BELOW. YOU WILL BE CONTACTED BY THE PROGRAM VIA E-MAIL TO PROVIDE A COPY OF YOUR W-9 USING A SECURE ONLINE PORTAL, IF IT IS NOT ALREADY ON FILE. YOU MUST LIST",{"$nulls":7},"TRADE ALLY CONTACT NAME"]
[]
[{"$nulls":8},"PRIMARY PHONE #",null,"E-MAIL ADDRESS"]
["AN E-MAIL ADDRESS IN SECTION 3. "]
[{"$nulls":4},"FEIN",{"$nulls":3},"TRADE ALLY COMPANY NAME"]
["TAX CLASSIFICATION OF CUSTOMER"]
["(Check one. Required for all businesses, including non-profits.)",{"$nulls":7},"ADDRESS"]
["Sole Proprietorship",null,"Individual",null,"Single Member - LLC"]
["C Corporation",null,"S Corporation",null,"Partnership",{"$nulls":3},"CITY",null,null,"STATE","ZIP"]
["Limited Liability Company - C Corp",{"$nulls":3},"Limited Liability Company - S Corp"]
["Limited Liability Company - Partnership",{"$nulls":7},"section 5"]
["Other:",{"$nulls":7},"BUSINESS PAYMENT INFORMATION"]
[{"$nulls":8},"Payee is responsible for any associated tax consequences."]
[{"$nulls":8},"Make incentive check payable to:"]
["OWNER NAME (REQUIRED IF SSN IS USED AS TAX IDENTIFICATION NUMBER)",{"$nulls":7},"        Customer","              Trade Ally","Other Payee"]
[{"$nulls":8},"If Other Payee is selected, the relationship to the utility account holder"]
["COMPANY NAME",{"$nulls":7},"must be identified below:"]
[{"$nulls":8},"        Tenant","       Building Owner","  Other (specify)"]
["LEGAL ADDRESS (AS SHOWN ON COMPANY W-9)",{"$nulls":7},"For All Payees"]
[{"$nulls":8},"Mail check to:","          Customer Legal Address",null,"Job Site Address"]
["CITY",{"$nulls":3},"STATE","ZIP",{"$nulls":3},"           Trade Ally Address",null,"Alternate Address"]
[]
["WHO DID YOU WORK WITH FROM FOCUS ON ENERGY? (CONTACT NAME)",{"$nulls":7},"COMPANY NAME"]
[]
["section 2",{"$nulls":7},"LEGAL ADDRESS (AS SHOWN ON COMPANY W-9)"]
["JOB SITE INFORMATION"]
["(Refer to your utility bills for account numbers below.)",{"$nulls":7},"CITY",null,null,"STATE","ZIP"]
[]
["JOB SITE BUSINESS NAME",{"$nulls":7},"ATTENTION TO (OPTIONAL)"]
[{"$nulls":8},"For Trade Ally and Other Payees"]
["ELECTRIC UTILITY AT JOB SITE",{"$nulls":3},"ELECTRIC ACCOUNT #",{"$nulls":3},"Trade Allies must be registered with the Program and have a current W-9 "]
["N/A",{"$nulls":3},"N/A",{"$nulls":3},"on file to receive payment."]
["GAS UTILITY AT JOB SITE",{"$nulls":3},"GAS ACCOUNT #",{"$nulls":3},"TAX IDENTIFICATION NUMBER   (Check one.) ",null,null,"  FEIN        or","       SSN"]
["Job Site Address is same as Legal Address",{"$nulls":7},"If you use a Social Security Number (SSN) as your TAX Identification Number, do not provide it below. You will be contacted by the Program via email to provide a copy of your W-9 using a secure online portal, if it is not already on file. You must list an email address below."]
["Job Site Address is different (complete below.)"]
[]
[]
["JOB SITE ADDRESS"]
[{"$nulls":8},"FEIN"]
["CITY",{"$nulls":3},"STATE","ZIP",null,null,"Tax Classification of Payee"]
[{"$nulls":8},"(Check one. Required for all businesses, including non-profits.)"]
["section 3",{"$nulls":7},"         Sole Proprietorship",null,"   Individual","          Single-Member LLC"]
["CUSTOMER CONTACT INFORMATION",{"$nulls":7},"          C Corporation",null,"   S Corporation","               Partnership"]
[{"$nulls":8},"  LLC - C Corp",null,"   LLC - S Corp","               LLC - Partnership"]
["JOB SITE CUSTOMER CONTACT NAME",{"$nulls":7},"         Other"]
[{"$nulls":8},"Payee Contact Information"]
["PRIMARY PHONE #",null,"E-MAIL ADDRESS"]
["         I opt in to receive program updates via text message.",{"$nulls":7},"NAME",null,"EMAIL ADDRESS"]
["Preferred method of contact:",null,"Call","           E-mail","        Text"]
["If Focus on Energy has a question about this application, we should contact:"]
["         Customer","         Trade Ally","Other"]

{"sheet":"Calculations","index":2,"n_rows":1541,"n_cols":45,"rows_kept":1541,"merged":[[17,1,17,9],[17,10,17,16],[17,17,17,19],[17,20,17,23],[17,24,17,28],[17,29,17,30],[17,31,17,33],[18,31,18,33],[19,31,19,33],[20,31,20,33],[21,31,21,33],[22,31,22,33],[23,31,23,33],[24,31,24,33],[25,31,25,33],[26,31,26,33],[27,31,27,33],[28,31,28,33],[29,31,29,33],[30,31,30,33],[31,31,31,33],[32,31,32,33],[33,31,33,33],[34,31,34,33],[35,31,35,33],[36,31,36,33],[37,31,37,33],[38,31,38,33],[39,31,39,33],[40,31,40,33],[41,31,41,33],[42,31,42,33],[43,31,43,33],[44,31,44,33],[45,31,45,33],[46,31,46,33],[47,31,47,33],[48,31,48,33],[49,31,49,33],[50,31,50,33],[51,31,51,33],[52,31,52,33],[53,31,53,33],[54,31,54,33],[55,31,55,33],[56,31,56,33],[57,31,57,33],[58,31,58,33],[59,31,59,33],[60,31,60,33],[61,31,61,33],[62,31,62,33],[63,31,63,33],[64,31,64,33],[65,31,65,33],[66,31,66,33],[67,31,67,33],[68,31,68,33],[69,31,69,33],[70,31,70,33],[71,31,71,33],[72,31,72,33],[73,31,73,33],[74,31,74,33],[75,31,75,33],[76,31,76,33],[77,31,77,33],[78,31,78,33],[79,31,79,33],[80,31,80,33],[81,31,81,33],[82,31,82,33],[83,31,83,33],[84,31,84,33],[85,31,85,33],[86,31,86,33],[87,31,87,33],[88,31,88,33],[89,31,89,33],[90,31,90,33],[91,31,91,33],[92,31,92,33],[93,31,93,33],[94,31,94,33],[95,31,95,33],[96,31,96,33],[97,31,97,33],[98,31,98,33],[99,31,99,33],[100,31,100,33],[101,31,101,33],[102,31,102,33],[103,31,103,33],[104,31,104,33],[105,31,105,33],[106,31,106,33],[107,31,107,33],[108,31,108,33],[109,31,109,33],[110,31,110,33],[111,31,111,33],[112,31,112,33],[113,31,113,33],[114,31,114,33],[115,31,115,33],[116,31,116,33],[117,31,117,33],[118,31,118,33],[119,31,119,33],[120,31,120,33],[121,31,121,33],[122,31,122,33],[123,31,123,33],[124,31,124,33],[125,31,125,33],[126,31,126,33],[127,31,127,33],[128,31,128,33],[129,31,129,33],[130,31,130,33],[131,31,131,33],[132,31,132,33],[133,31,133,33],[134,31,134,33],[135,31,135,33],[136,31,136,33],[137,31,137,33],[138,31,138,33],[139,31,139,33],[140,31,140,33],[141,31,141,33],[142,31,142,33],[143,31,143,33],[144,31,144,33],[145,31,145,33],[146,31,146,33],[147,31,147,33],[148,31,148,33],[149,31,149,33],[150,31,150,33],[151,31,151,33],[152,31,152,33],[153,31,153,33],[154,31,154,33],[155,31,155,33],[156,31,156,33],[157,31,157,33],[158,31,158,33],[159,31,159,33],[160,31,160,33],[161,31,161,33],[162,31,162,33],[163,31,163,33],[164,31,164,33],[165,31,165,33],[166,31,166,33],[167,31,167,33],[168,31,168,33],[169,31,169,33],[170,31,170,33],[171,31,171,33],[172,31,172,33],[173,31,173,33],[174,31,174,33],[175,31,175,33],[176,31,176,33],[177,31,177,33],[178,31,178,33],[179,31,179,33],[180,31,180,33],[181,31,181,33],[182,31,182,33],[183,31,183,33],[184,31,184,33],[185,31,185,33],[186,31,186,33],[187,31,187,33],[188,31,188,33],[189,31,189,33],[190,31,190,33],[191,31,191,33],[192,31,192,33],[193,31,193,33],[194,31,194,33],[195,31,195,33],[196,31,196,33],[197,31,197,33],[198,31,198,33],[199,31,199,33],[200,31,200,33],[201,31,201,33],[202,31,202,33],[203,31,203,33],[204,31,204,33],[205,31,205,33],[206,31,206,33],[207,31,207,33],[208,31,208,33],[209,31,209,33],[210,31,210,33],[211,31,211,33],[212,31,212,33],[213,31,213,33],[214,31,214,33],[215,31,215,33],[216,31,216,33],[217,31,217,33],[218,31,218,33],[219,31,219,33],[220,31,220,33],[221,31,221,33],[222,31,222,33],[223,31,223,33],[224,31,224,33],[225,31,225,33],[226,31,226,33],[227,31,227,33],[228,31,228,33],[229,31,229,33],[230,31,230,33],[231,31,231,33],[232,31,232,33],[233,31,233,33],[234,31,234,33],[235,31,235,33],[236,31,236,33],[237,31,237,33],[238,31,238,33],[239,31,239,33],[240,31,240,33],[241,31,241,33],[242,31,242,33],[243,31,243,33],[244,31,244,33],[245,31,245,33],[246,31,246,33],[247,31,247,33],[248,31,248,33],[249,31,249,33],[250,31,250,33],[251,31,251,33],[252,31,252,33],[253,31,253,33],[254,31,254,33],[255,31,255,33],[256,31,256,33],[257,31,257,33],[258,31,258,33],[259,31,259,33],[260,31,260,33],[261,31,261,33],[262,31,262,33],[263,31,263,33],[264,31,264,33],[265,31,265,33],[266,31,266,33],[267,31,267,33],[268,31,268,33],[269,31,269,33],[270,31,270,33],[271,31,271,33],[272,31,272,33],[273,31,273,33],[274,31,274,33],[275,31,275,33],[276,31,276,33],[277,31,277,33],[278,31,278,33],[279,31,279,33],[280,31,280,33],[281,31,281,33],[282,31,282,33],[283,31,283,33],[284,31,284,33],[285,31,285,33],[286,31,286,33],[287,31,287,33],[288,31,288,33],[289,31,289,33],[290,31,290,33],[291,31,291,33],[292,31,292,33],[293,31,293,33],[294,31,294,33],[295,31,295,33],[296,31,296,33],[297,31,297,33],[298,31,298,33],[299,31,299,33],[300,31,300,33],[301,31,301,33],[302,31,302,33],[303,31,303,33],[304,31,304,33],[305,31,305,33],[306,31,306,33],[307,31,307,33],[308,31,308,33],[309,31,309,33],[310,31,310,33],[311,31,311,33],[312,31,312,33],[313,31,313,33],[314,31,314,33],[315,31,315,33],[316,31,316,33],[317,31,317,33],[318,31,318,33],[319,31,319,33],[320,31,320,33],[321,31,321,33],[322,31,322,33],[323,31,323,33],[324,31,324,33],[325,31,325,33],[326,31,326,33],[327,31,327,33],[328,31,328,33],[329,31,329,33],[330,31,330,33],[331,31,331,33],[332,31,332,33],[333,31,333,33],[334,31,334,33],[335,31,335,33],[336,31,336,33],[337,31,337,33],[338,31,338,33],[339,31,339,33],[340,31,340,33],[341,31,341,33],[342,31,342,33],[343,31,343,33],[344,31,344,33],[345,31,345,33],[346,31,346,33],[347,31,347,33],[348,31,348,33],[349,31,349,33],[350,31,350,33],[351,31,351,33],[352,31,352,33],[353,31,353,33],[354,31,354,33],[355,31,355,33],[356,31,356,33],[357,31,357,33],[358,31,358,33],[359,31,359,33],[360,31,360,33],[361,31,361,33],[362,31,362,33],[363,31,363,33],[364,31,364,33],[365,31,365,33],[366,31,366,33],[367,31,367,33],[368,31,368,33],[369,31,369,33],[370,31,370,33],[371,31,371,33],[372,31,372,33],[373,31,373,33],[374,31,374,33],[375,31,375,33],[376,31,376,33],[377,31,377,33],[378,31,378,33],[379,31,379,33],[380,31,380,33],[381,31,381,33],[382,31,382,33],[383,31,383,33],[384,31,384,33],[385,31,385,33],[386,31,386,33],[387,31,387,33],[388,31,388,33],[389,31,389,33],[390,31,390,33],[391,31,391,33],[392,31,392,33],[393,31,393,33],[394,31,394,33],[395,31,395,33],[396,31,396,33],[397,31,397,33],[398,31,398,33],[399,31,399,33],[400,31,400,33],[401,31,401,33],[402,31,402,33],[403,31,403,33],[404,31,404,33],[405,31,405,33],[406,31,406,33],[407,31,407,33],[408,31,408,33],[409,31,409,33],[410,31,410,33],[411,31,411,33],[412,31,412,33],[413,31,413,33],[414,31,414,33],[415,31,415,33],[416,31,416,33],[417,31,417,33],[418,31,418,33],[419,31,419,33],[420,31,420,33],[421,31,421,33],[422,31,422,33],[423,31,423,33],[424,31,424,33],[425,31,425,33],[426,31,426,33],[427,31,427,33],[428,31,428,33],[429,31,429,33],[430,31,430,33],[431,31,431,33],[432,31,432,33],[433,31,433,33],[434,31,434,33],[435,31,435,33],[436,31,436,33],[437,31,437,33],[438,31,438,33],[439,31,439,33],[440,31,440,33],[441,31,441,33],[442,31,442,33],[443,31,443,33],[444,31,444,33],[445,31,445,33],[446,31,446,33],[447,31,447,33],[448,31,448,33],[449,31,449,33],[450,31,450,33],[451,31,451,33],[452,31,452,33],[453,31,453,33],[454,31,454,33],[455,31,455,33],[456,31,456,33],[457,31,457,33],[458,31,458,33],[459,31,459,33],[460,31,460,33],[461,31,461,33],[462,31,462,33],[463,31,463,33],[464,31,464,33],[465,31,465,33],[466,31,466,33],[467,31,467,33],[468,31,468,33],[469,31,469,33],[470,31,470,33],[471,31,471,33],[472,31,472,33],[473,31,473,33],[474,31,474,33],[475,31,475,33],[476,31,476,33],[477,31,477,33],[478,31,478,33],[479,31,479,33],[480,31,480,33],[481,31,481,33],[482,31,482,33],[483,31,483,33],[484,31,484,33],[485,31,485,33],[486,31,486,33],[487,31,487,33],[488,31,488,33],[489,31,489,33],[490,31,490,33],[491,31,491,33],[492,31,492,33],[493,31,493,33],[494,31,494,33],[495,31,495,33],[496,31,496,33],[497,31,497,33],[498,31,498,33],[499,31,499,33],[500,31,500,33],[501,31,501,33],[502,31,502,33],[503,31,503,33],[504,31,504,33],[505,31,505,33],[506,31,506,33],[507,31,507,33],[508,31,508,33],[509,31,509,33],[510,31,510,33],[511,31,511,33],[512,31,512,33],[513,31,513,33],[514,31,514,33],[515,31,515,33],[516,31,516,33],[517,31,517,33],[518,31,518,33],[519,31,519,33],[520,31,520,33],[521,31,521,33],[522,31,522,33],[523,31,523,33],[524,31,524,33],[525,31,525,33],[526,31,526,33],[527,31,527,33],[528,31,528,33],[529,31,529,33],[530,31,530,33],[531,31,531,33],[532,31,532,33],[533,31,533,33],[534,31,534,33],[535,31,535,33],[536,31,536,33],[537,31,537,33],[538,31,538,33],[539,31,539,33],[540,31,540,33],[541,31,541,33],[542,31,542,33],[543,31,543,33],[544,31,544,33],[545,31,545,33],[546,31,546,33],[547,31,547,33],[548,31,548,33],[549,31,549,33],[550,31,550,33],[551,31,551,33],[552,31,552,33],[553,31,553,33],[554,31,554,33],[555,31,555,33],[556,31,556,33],[557,31,557,33],[558,31,558,33],[559,31,559,33],[560,31,560,33],[561,31,561,33],[562,31,562,33],[563,31,563,33],[564,31,564,33],[565,31,565,33],[566,31,566,33],[567,31,567,33],[568,31,568,33],[569,31,569,33],[570,31,570,33],[571,31,571,33],[572,31,572,33],[573,31,573,33],[574,31,574,33],[575,31,575,33],[576,31,576,33],[577,31,577,33],[578,31,578,33],[579,31,579,33],[580,31,580,33],[581,31,581,33],[582,31,582,33],[583,31,583,33],[584,31,584,33],[585,31,585,33],[586,31,586,33],[587,31,587,33],[588,31,588,33],[589,31,589,33],[590,31,590,33],[591,31,591,33],[592,31,592,33],[593,31,593,33],[594,31,594,33],[595,31,595,33],[596,31,596,33],[597,31,597,33],[598,31,598,33],[599,31,599,33],[600,31,600,33],[601,31,601,33],[602,31,602,33],[603,31,603,33],[604,31,604,33],[605,31,605,33],[606,31,606,33],[607,31,607,33],[608,31,608,33],[609,31,609,33],[610,31,610,33],[611,31,611,33],[612,31,612,33],[613,31,613,33],[614,31,614,33],[615,31,615,33],[616,31,616,33],[617,31,617,33],[618,31,618,33],[619,31,619,33],[620,31,620,33],[621,31,621,33],[622,31,622,33],[623,31,623,33],[624,31,624,33],[625,31,625,33],[626,31,626,33],[627,31,627,33],[628,31,628,33],[629,31,629,33],[630,31,630,33],[631,31,631,33],[632,31,632,33],[633,31,633,33],[634,31,634,33],[635,31,635,33],[636,31,636,33],[637,31,637,33],[638,31,638,33],[639,31,639,33],[640,31,640,33],[641,31,641,33],[642,31,642,33],[643,31,643,33],[644,31,644,33],[645,31,645,33],[646,31,646,33],[647,31,647,33],[648,31,648,33],[649,31,649,33],[650,31,650,33],[651,31,651,33],[652,31,652,33],[653,31,653,33],[654,31,654,33],[655,31,655,33],[656,31,656,33],[657,31,657,33],[658,31,658,33],[659,31,659,33],[660,31,660,33],[661,31,661,33],[662,31,662,33],[663,31,663,33],[664,31,664,33],[665,31,665,33],[666,31,666,33],[667,31,667,33],[668,31,668,33],[669,31,669,33],[670,31,670,33],[671,31,671,33],[672,31,672,33],[673,31,673,33],[674,31,674,33],[675,31,675,33],[676,31,676,33],[677,31,677,33],[678,31,678,33],[679,31,679,33],[680,31,680,33],[681,31,681,33],[682,31,682,33],[683,31,683,33],[684,31,684,33],[685,31,685,33],[686,31,686,33],[687,31,687,33],[688,31,688,33],[689,31,689,33],[690,31,690,33],[691,31,691,33],[692,31,692,33],[693,31,693,33],[694,31,694,33],[695,31,695,33],[696,31,696,33],[697,31,697,33],[698,31,698,33],[699,31,699,33],[700,31,700,33],[701,31,701,33],[702,31,702,33],[703,31,703,33],[704,31,704,33],[705,31,705,33],[706,31,706,33],[707,31,707,33],[708,31,708,33],[709,31,709,33],[710,31,710,33],[711,31,711,33],[712,31,712,33],[713,31,713,33],[714,31,714,33],[715,31,715,33],[716,31,716,33],[717,31,717,33],[718,31,718,33],[719,31,719,33],[720,31,720,33],[721,31,721,33],[722,31,722,33],[723,31,723,33],[724,31,724,33],[725,31,725,33],[726,31,726,33],[727,31,727,33],[728,31,728,33],[729,31,729,33],[730,31,730,33],[731,31,731,33],[732,31,732,33],[733,31,733,33],[734,31,734,33],[735,31,735,33],[736,31,736,33],[737,31,737,33],[738,31,738,33],[739,31,739,33],[740,31,740,33],[741,31,741,33],[742,31,742,33],[743,31,743,33],[744,31,744,33],[745,31,745,33],[746,31,746,33],[747,31,747,33],[748,31,748,33],[749,31,749,33],[750,31,750,33],[751,31,751,33],[752,31,752,33],[753,31,753,33],[754,31,754,33],[755,31,755,33],[756,31,756,33],[757,31,757,33],[758,31,758,33],[759,31,759,33],[760,31,760,33],[761,31,761,33],[762,31,762,33],[763,31,763,33],[764,31,764,33],[765,31,765,33],[766,31,766,33],[767,31,767,33],[768,31,768,33],[769,31,769,33],[770,31,770,33],[771,31,771,33],[772,31,772,33],[773,31,773,33],[774,31,774,33],[775,31,775,33],[776,31,776,33],[777,31,777,33],[778,31,778,33],[779,31,779,33],[780,31,780,33],[781,31,781,33],[782,31,782,33],[783,31,783,33],[784,31,784,33],[785,31,785,33],[786,31,786,33],[787,31,787,33],[788,31,788,33],[789,31,789,33],[790,31,790,33],[791,31,791,33],[792,31,792,33],[793,31,793,33],[794,31,794,33],[795,31,795,33],[796,31,796,33],[797,31,797,33],[798,31,798,33],[799,31,799,33],[800,31,800,33],[801,31,801,33],[802,31,802,33],[803,31,803,33],[804,31,804,33],[805,31,805,33],[806,31,806,33],[807,31,807,33],[808,31,808,33],[809,31,809,33],[810,31,810,33],[811,31,811,33],[812,31,812,33],[813,31,813,33],[814,31,814,33],[815,31,815,33],[816,31,816,33],[817,31,817,33],[818,31,818,33],[819,31,819,33],[820,31,820,33],[821,31,821,33],[822,31,822,33],[823,31,823,33],[824,31,824,33],[825,31,825,33],[826,31,826,33],[827,31,827,33],[828,31,828,33],[829,31,829,33],[830,31,830,33],[831,31,831,33],[832,31,832,33],[833,31,833,33],[834,31,834,33],[835,31,835,33],[836,31,836,33],[837,31,837,33],[838,31,838,33],[839,31,839,33],[840,31,840,33],[841,31,841,33],[842,31,842,33],[843,31,843,33],[844,31,844,33],[845,31,845,33],[846,31,846,33],[847,31,847,33],[848,31,848,33],[849,31,849,33],[850,31,850,33],[851,31,851,33],[852,31,852,33],[853,31,853,33],[854,31,854,33],[855,31,855,33],[856,31,856,33],[857,31,857,33],[858,31,858,33],[859,31,859,33],[860,31,860,33],[861,31,861,33],[862,31,862,33],[863,31,863,33],[864,31,864,33],[865,31,865,33],[866,31,866,33],[867,31,867,33],[868,31,868,33],[869,31,869,33],[870,31,870,33],[871,31,871,33],[872,31,872,33],[873,31,873,33],[874,31,874,33],[875,31,875,33],[876,31,876,33],[877,31,877,33],[878,31,878,33],[879,31,879,33],[880,31,880,33],[881,31,881,33],[882,31,882,33],[883,31,883,33],[884,31,884,33],[885,31,885,33],[886,31,886,33],[887,31,887,33],[888,31,888,33],[889,31,889,33],[890,31,890,33],[891,31,891,33],[892,31,892,33],[893,31,893,33],[894,31,894,33],[895,31,895,33],[896,31,896,33],[897,31,897,33],[898,31,898,33],[899,31,899,33],[900,31,900,33],[901,31,901,33],[902,31,902,33],[903,31,903,33],[904,31,904,33],[905,31,905,33],[906,31,906,33],[907,31,907,33],[908,31,908,33],[909,31,909,33],[910,31,910,33],[911,31,911,33],[912,31,912,33],[913,31,913,33],[914,31,914,33],[915,31,915,33],[916,31,916,33],[917,31,917,33],[918,31,918,33],[919,31,919,33],[920,31,920,33],[921,31,921,33],[922,31,922,33],[923,31,923,33],[924,31,924,33],[925,31,925,33],[926,31,926,33],[927,31,927,33],[928,31,928,33],[929,31,929,33],[930,31,930,33],[931,31,931,33],[932,31,932,33],[933,31,933,33],[934,31,934,33],[935,31,935,33],[936,31,936,33],[944,31,944,33],[945,31,945,33],[946,31,946,33],[947,31,947,33],[948,31,948,33],[949,31,949,33],[950,31,950,33],[951,31,951,33],[952,31,952,33],[995,31,995,33],[996,31,996,33],[997,31,997,33],[998,31,998,33],[999,31,999,33],[1000,31,1000,33],[1001,31,1001,33],[1002,31,1002,33],[1003,31,1003,33],[1004,31,1004,33],[1005,31,1005,33],[1006,31,1006,33],[1007,31,1007,33],[1008,31,1008,33],[1009,31,1009,33],[1010,31,1010,33],[1011,31,1011,33],[1012,31,1012,33],[1013,31,1013,33],[1014,31,1014,33],[1015,31,1015,33],[1016,31,1016,33],[1017,31,1017,33],[1018,31,1018,33],[1024,10,1024,23],[1025,3,1025,4],[1025,13,1025,14],[1025,15,1025,16],[1025,18,1025,20],[1025,21,1025,23],[1026,3,1026,4],[1026,13,1026,14],[1026,15,1026,16],[1026,18,1026,20],[1026,21,1026,23],[1027,3,1027,4],[1027,13,1027,14],[1027,15,1027,16],[1027,18,1027,20],[1027,21,1027,23],[1028,3,1028,4],[1028,13,1028,14],[1028,15,1028,16],[1028,18,1028,20],[1028,21,1028,23],[1029,18,1029,20],[1030,18,1030,20],[1033,2,1033,16],[1034,2,1034,16],[1035,2,1035,16],[1036,2,1036,16],[1037,2,1037,16],[1038,2,1038,16],[1038,21,1039,21],[1038,22,1039,22],[1038,23,1039,23],[1038,24,1039,24],[1039,2,1039,16],[1040,2,1040,16],[1041,2,1041,16],[1042,2,1042,16],[1043,2,1043,16],[1044,2,1044,16],[1045,2,1045,16],[1046,2,1046,16]],"merged_total":1049,"flags":["merged_cut"]}
[{"$nulls":10},"2023 Incentive Rates","Last Updated: ",{"$f":"MAX('Version History'!$B$5:$B$40)","v":"2022-12-22"},{"$nulls":21},"Hide"]
[null,"Comprehensive Lighting Solutions"]
[]
[null,null,"Project Information"]
[{"$nulls":3},"Customer Name:",{"$nulls":3},"User Input"]
[{"$nulls":3},"Facility Name:",{"$nulls":3},"Calc Output"]
[{"$nulls":3},"Sector for Annual Run Hours:","Schools & Gov"]
[{"$nulls":3},"Annual Run Hours:","Default Sector Hours",{"$f":"IF(E8=\"Default Sector Hours\",IF(COUNTIF($AI$20:$AI$1019,\"Yes\")>0,\"To enter site specific hours of operation, change 'Annual Run Hours' from 'Default Sector Hours' to 'Manual Input'\",\"\"),\"\")","v":""}]
[{"$nulls":3},"Building Type for Coincidence Factor:","_Sector Default_","Coincidence Factor = ",{"$f":"VLOOKUP(E9,$AB$1036:$AC$1072,2,FALSE)","v":0.64}]
[{"$nulls":3},"Sector for Utility Rates:","Commercial/Schools & Government"]
[{"$nulls":3},"Interior or 24/7 (On-Peak) Utility Rate:",{"$f":"VLOOKUP(E10,V1045:X1047,2,FALSE)","v":{"v":0.1109,"d":"$0.1109"}},"Actual, if known."]
[{"$nulls":3},"Exterior (Off-Peak) Utility Rate:",{"v":0.077,"d":"$0.077"},"Actual, if known."]
[{"$nulls":3},"Estimated Project Size:","Small (10 rows)","Adjusts number of line items currently being shown."]
[{"$nulls":3},"% of Project Cost Cap:",{"v":0.5,"d":"50%"}]
[{"$nulls":3},"Baseline Adjustment to Account for Existing Controls:",{"v":0.1,"d":"10%"},"Interior",{"v":0,"d":"0%"},"Exterior"]
[]
[]
[null,"EXISTING LIGHTING",{"$nulls":8},"PROPOSED LIGHTING",{"$nulls":6},"ADDITIONAL INPUTS",null,null,"LIGHTING ENERGY USE",{"$nulls":3},"TOTAL ENERGY SAVINGS AND INCENTIVE",{"$nulls":4},"COSTS",null,"Notes & Supporting Docs"]
[null,"Line #","Location","Existing Lighting Category","Existing Lighting Fixture/Lamp","Description / Notes","Existing QTY","Default Input Watts","Manual Input Watts","Existing Annual Hours","Proposed Lighting Category","Proposed Lighting Fixture/Lamp","Description / Notes","Proposed QTY","Default Input Watts","Manual Input Watts","Proposed Annual Hours","Interior or Exterior?","On NLC Controls?","Qualifies for Prescriptive","Existing Peak kW","Existing kWh","Proposed Peak kW","Proposed kWh","Watts Reduced","Peak kW Savings","Annual kWh Savings","Qualifies for Code","Prescriptive     Incentive Code","Unit Cost","Total Cost",{"$nulls":3},"Existing Hours Overridden"]
[null,1,{"$nulls":5},{"$f":"IF(E20=\"\",\"\",VLOOKUP(E20,$AO$1114:$AP$1541,2,FALSE))","v":""},null,{"$f":"IF(AND(E20<>\"\",G20<>\"\",$E$8=\"Default Sector Hours\"),VLOOKUP(IF(R20=\"Exterior\",\"Exterior\",$E$7),$V$1036:$W$1041,2,FALSE),\"\")","v":""},{"$nulls":4},{"$f":"IF(L20=\"\",\"\",VLOOKUP(L20,$AO$1113:$AP$1541,2,FALSE))","v":""},null,{"$f":"IF(J20=\"\",\"\",J20)","v":""},null,"No",null,{"$f":"IF(R20=\"Interior\",IF(E20=\"\",\"\",IF(OR(I20>0,H20=\"Enter Watts\"),I20*G20/1000*(1-$E$15),H20*G20/1000*(1-$E$15))),IF(E20=\"\",\"\",0))","v":""},{"$f":"IFERROR(IF(E20=\"\",\"\",G20/1000*IF(OR(I20>0,H20=\"Enter Watts\"),I20,H20)*IF(R20=\"Exterior\",$W$1041*(1-$G$15),IF($E$8=\"Manual Input\",J20,VLOOKUP($E$7,$V$1036:$Y$1040,2,FALSE))*(1-$E$15)      )),\"0\")","v":""},{"$f":"IF(R20=\"Interior\",IF(AND(L20=\"\", E20=\"\"),\"\",IF(OR(P20>0,O20=\"Enter Watts\", P20=\"\"),P20*N20*(1-$Z$1036)/1000,O20*N20*(1-$Z$1036)/1000)),IF(AND(E20=\"\",L20=\"\"),\"\",0))","v":""},{"$f":"IFERROR(IF(AND(L20=\"\", E20=\"\"),\"\",N20/1000*IF(OR(P20>0,O20=\"Enter Watts\"),P20,O20)*IF(R20=\"Exterior\",$W$1041,IF($E$8=\"Manual Input\",Q20,VLOOKUP($E$7,$V$1036:$Y$1040,2,FALSE)))*IF(S20=\"Yes\",IF(R20=\"Exterior\",1-$Y$1041,1-VLOOKUP($E$7,$V$1036:$Y$1040,4,FALSE)),1)),0)","v":""},{"$f":"IFERROR(IF(OR(I20>0,H20=\"Enter Watts\"),I20*G20,H20*G20)-IF(OR(P20>0,O20=\"Enter Watts\"),P20*N20,O20*N20),\"\")","v":""},{"$f":"IF(AND(U20=\"\",W20=\"\"),\"\",IF(OR(U20=\"\",W20=\"\"),0,  IF($E$8=\"Manual Input\",$G$9,   VLOOKUP($E$7,$V$1036:$Y$1041,3,FALSE))     *(U20-W20)))","v":""},{"$f":"IF(AND(V20=\"\",X20=\"\"),\"\",IF(OR(V20=\"\",X20=\"\"),0,V20-X20))","v":""},{"$f":"IF(AA20=\"\",\"\",IF(AND(R20=\"Interior\",S20=\"No\",OR(T20=\"\",T20=\"No\")),$J$1027,IF(AND(R20=\"Interior\",S20=\"Yes\"),$J$1028,IF(AND(R20=\"Exterior\",S20=\"Yes\"),$J$1029,IF(AND(R20=\"Exterior\",S20=\"No\",N20<>G20),\"DNQ\",\"See Lighting Catalog to determine Code\")))))","v":""},null,null,{"$f":"AD20*N20","v":0},{"$nulls":3},{"$f":"IF(_xlfn.ISFORMULA(J20)=TRUE,\"No\",\"Yes\")","v":"No"},{"$nulls":6},"","",null,""]
[null,2,{"$nulls":5},"",null,"",{"$nulls":4},"",null,{"$f":"IF(J21=\"\",\"\",J21)","v":""},null,"No",null,{"$f":"IF(R21=\"Interior\",IF(E21=\"\",\"\",IF(OR(I21>0,H21=\"Enter Watts\"),I21*G21/1000*(1-$E$15),H21*G21/1000*(1-$E$15))),IF(E21=\"\",\"\",0))","v":""},"",{"$f":"IF(R21=\"Interior\",IF(AND(L21=\"\", E21=\"\"),\"\",IF(OR(P21>0,O21=\"Enter Watts\", P21=\"\"),P21*N21*(1-$Z$1036)/1000,O21*N21*(1-$Z$1036)/1000)),IF(AND(E21=\"\",L21=\"\"),\"\",0))","v":""},"",{"$f":"IFERROR(IF(OR(I21>0,H21=\"Enter Watts\"),I21*G21,H21*G21)-IF(OR(P21>0,O21=\"Enter Watts\"),P21*N21,O21*N21),\"\")","v":""},{"$f":"IF(AND(U21=\"\",W21=\"\"),\"\",IF(OR(U21=\"\",W21=\"\"),0,  IF($E$8=\"Manual Input\",$G$9,   VLOOKUP($E$7,$V$1036:$Y$1041,3,FALSE))     *(U21-W21)))","v":""},{"$f":"IF(AND(V21=\"\",X21=\"\"),\"\",IF(OR(V21=\"\",X21=\"\"),0,V21-X21))","v":""},"",null,null,{"$f":"AD21*N21","v":0},{"$nulls":3},{"$f":"IF(_xlfn.ISFORMULA(J21)=TRUE,\"No\",\"Yes\")","v":"No"}]
[null,3,{"$nulls":5},"",null,"",{"$nulls":4},"",null,"",null,"No",null,"","","","",{"$f":"IFERROR(IF(OR(I22>0,H22=\"Enter Watts\"),I22*G22,H22*G22)-IF(OR(P22>0,O22=\"Enter Watts\"),P22*N22,O22*N22),\"\")","v":""},"",{"$f":"IF(AND(V22=\"\",X22=\"\"),\"\",IF(OR(V22=\"\",X22=\"\"),0,V22-X22))","v":""},"",null,null,0,{"$nulls":3},"No"]
[null,4,{"$nulls":5},"",null,"",{"$nulls":4},"",null,"",null,"No",null,"","","","","","","","",null,null,0,{"$nulls":3},"No"]
[null,5,{"$nulls":5},"",null,"",{"$nulls":4},"",null,"",null,"No",null,"","","","","","","","",null,null,0,{"$nulls":3},"No"]
[null,6,{"$nulls":5},"",null,"",{"$nulls":4},"",null,"",null,"No",null,"","","","","","","","",null,null,0,{"$nulls":3},"No",{"$nulls":6},"","",null,""]
[null,7,{"$nulls":5},"",null,"",{"$nulls":4},"",null,"",null,"No",null,"","","","","","","","",null,null,0,{"$nulls":3},"No"]
[null,8,{"$nulls":5},"",null,"",{"$nulls":4},"",null,"",null,"No",null,"","","","","","","","",null,null,0,{"$nulls":3},"No"]
[null,9,{"$nulls":5},"",null,"",{"$nulls":4},"",null,"",null,"No",null,"","","","","","","","",null,null,0,{"$nulls":3},"No"]
[null,10,{"$nulls":5},"",null,"",{"$nulls":4},"",null,"",null,"No",null,"","","","",{"$f":"IFERROR(IF(OR(I29>0,H29=\"Enter Watts\"),I29*G29,H29*G29)-IF(OR(P29>0,O29=\"Enter Watts\"),P29*N29,O29*N29),\"\")","v":""},"","","",null,null,0,{"$nulls":3},"No"]
[null,11,{"$nulls":5},"",null,"",{"$nulls":4},"",null,"",null,"No",null,"","","","","","","","",null,null,0,{"$nulls":3},"No"]
[null,12,{"$nulls":5},"",null,"",{"$nulls":4},"",null,"",null,"No",null,"","","","","","","","",null,null,0,{"$nulls":3},"No",{"$nulls":6},"","",null,""]
[null,13,{"$nulls":5},"",null,"",{"$nulls":4},"",null,"",null,"No",null,"","","","","","","","",null,null,0,{"$nulls":3},"No"]
[null,14,{"$nulls":5},"",null,"",{"$nulls":4},"",null,"",null,"No",null,"","","","","","","","",null,null,0,{"$nulls":3},"No"]
[null,15,{"$nulls":5},"",null,"",{"$nulls":4},"",null,"",null,"No",null,"","","","","","","","",null,null,0,{"$nulls":3},"No"]
[null,16,{"$nulls":5},"",null,"",{"$nulls":4},"",null,"",null,"No",null,"","","","","","","","",null,null,0,{"$nulls":3},"No"]
[null,17,{"$nulls":5},"",null,"",{"$nulls":4},"",null,"",null,"No",null,"","","","","","","","",null,null,0,{"$nulls":3},"No"]
[null,18,{"$nulls":5},"",null,"",{"$nulls":4},"",null,"",null,"No",null,"","","","","","","","",null,null,0,{"$nulls":3},"No"]
[null,19,{"$nulls":5},"",null,"",{"$nulls":4},"",null,"",null,"No",null,"","","","","","","","",null,null,0,{"$nulls":3},"No",{"$nulls":6},"","",null,""]
[null,20,{"$nulls":5},"",null,"",{"$nulls":4},"",null,"",null,"No",null,"","","","","","","","",null,null,0,{"$nulls":3},"No"]
[null,21,{"$nulls":5},"",null,"",{"$nulls":4},"",null,"",null,"No",null,"","","","","","","","",null,null,0,{"$nulls":3},"No"]
[null,22,{"$nulls":5},"",null,"",{"$nulls":4},"",null,"",null,"No",null,"","","","","","","","",null,null,0,{"$nulls":3},"No"]
[null,23,{"$nulls":5},"",null,"",{"$nulls":4},"",null,"",null,"No",null,"","","","","","","","",null,null,0,{"$nulls":3},"No"]
[null,24,{"$nulls":5},"",null,"",{"$nulls":4},"",null,"",null,"No",null,"","","","","","","","",null,null,0,{"$nulls":3},"No"]
[null,25,{"$nulls":5},"",null,"",{"$nulls":4},"",null,"",null,"No",null,"","","","","","","","",null,null,0,{"$nulls":3},"No",{"$nulls":6},"","",null,""]
[null,26,{"$nulls":5},"",null,"",{"$nulls":4},"",null,"",null,"No",null,"","","","","","","","",null,null,0,{"$nulls":3},"No"]
[null,27,{"$nulls":5},"",null,"",{"$nulls":4},"",null,"",null,"No",null,"","","","","","","","",null,null,0,{"$nulls":3},"No"]
[null,28,{"$nulls":5},"",null,"",{"$nulls":4},"",null,"",null,"No",null,"","","","","","","","",null,null,0,{"$nulls":3},"No"]
[null,29,{"$nulls":5},"",null,"",{"$nulls":4},"",null,"",null,"No",null,"","","","","","","","",null,null,0,{"$nulls":3},"No"]
[null,30,{"$nulls":5},"",null,"",{"$nulls":4},"",null,"",null,"No",null,"","","","","","","","",null,null,0,{"$nulls":3},"No"]
[null,31,{"$nulls":5},"",null,"",{"$nulls":4},"",null,"",null,"No",null,"","","","","","","","",null,null,0,{"$nulls":3},"No"]
[null,32,{"$nulls":5},"",null,"",{"$nulls":4},"",null,"",null,"No",null,"","","","","","","","",null,null,0,{"$nulls":3},"No"]
[null,33,{"$nulls":5},"",null,"",{"$nulls":4},"",null,"",null,"No",null,"","","","","","","","",null,null,0,{"$nulls":3},"No"]
[null,34,{"$nulls":5},"",null,"",{"$nulls":4},"",null,"",null,"No",null,"","","","","","","","",null,null,0,{"$nulls":3},"No"]
[null,35,{"$nulls":5},"",null,"",{"$nulls":4},"",null,"",null,"No",null,"","","","","","","","",null,null,0,{"$nulls":3},"No"]
[null,36,{"$nulls":5},"",null,"",{"$nulls":4},"",null,"",null,"No",null,"","","","","","","","",null,null,0,{"$nulls":3},"No"]
[null,37,{"$nulls":5},"",null,"",{"$nulls":4},"",null,"",null,"No",null,"","","","","","","","",null,null,0,{"$nulls":3},"No",{"$nulls":6},"","",null,""]
[null,38,{"$nulls":5},"",null,"",{"$nulls":4},"",null,"",null,"No",null,"","","","","","","","",null,null,0,{"$nulls":3},"No"]
[null,39,{"$nulls":5},"",null,"",{"$nulls":4},"",null,"",null,"No",null,"","","","","","","","",null,null,0,{"$nulls":3},"No"]
[null,40,{"$nulls":5},"",null,"",{"$nulls":4},"",null,"",null,"No",null,"","","","","","","","",null,null,0,{"$nulls":3},"No"]
[null,41,{"$nulls":5},"",null,"",{"$nulls":4},"",null,"",null,"No",null,"","","","","","","","",null,null,0,{"$nulls":3},"No"]
[null,42,{"$nulls":5},"",null,"",{"$nulls":4},"",null,"",null,"No",null,"","","","","","","","",null,null,0,{"$nulls":3},"No"]
[null,43,{"$nulls":5},"",null,"",{"$nulls":4},"",null,"",null,"No",null,"","","","","","","","",null,null,0,{"$nulls":3},"No",{"$nulls":6},"","",null,""]
[null,44,{"$nulls":5},"",null,"",{"$nulls":4},"",null,"",null,"No",null,"","","","","","","","",null,null,0,{"$nulls":3},"No"]
[null,45,{"$nulls":5},"",null,"",{"$nulls":4},"",null,"",null,"No",null,"","","","","","","","",null,null,0,{"$nulls":3},"No"]
[null,46,{"$nulls":5},"",null,"",{"$nulls":4},"",null,"",null,"No",null,"","","","","","","","",null,null,0,{"$nulls":3},"No"]
[null,47,{"$nulls":5},"",null,"",{"$nulls":4},"",null,"",null,"No",null,"","","","","","","","",null,null,0,{"$nulls":3},"No"]
[null,48,{"$nulls":5},"",null,"",{"$nulls":4},"",null,"",null,"No",null,"","","","","","","","",null,null,0,{"$nulls":3},"No"]
[null,49,{"$nulls":5},"",null,"",{"$nulls":4},"",null,"",null,"No",null,"","","","","","","","",null,null,0,{"$nulls":3},"No"]
[null,50,{"$nulls":5},"",null,"",{"$nulls":4},"",null,"",null,"No",null,"","","","",{"$f":"IFERROR(IF(OR(I69>0,H69=\"Enter Watts\"),I69*G69,H69*G69)-IF(OR(P69>0,O69=\"Enter Watts\"),P69*N69,O69*N69),\"\")","v":""},"",{"$f":"IF(AND(V69=\"\",X69=\"\"),\"\",IF(OR(V69=\"\",X69=\"\"),0,V69-X69))","v":""},"",null,null,0,{"$nulls":3},"No"]
[null,51,{"$nulls":5},"",null,"",{"$nulls":4},"",null,"",null,"No",null,"","","","",{"$f":"IFERROR(IF(OR(I70>0,H70=\"Enter Watts\"),I70*G70,H70*G70)-IF(OR(P70>0,O70=\"Enter Watts\"),P70*N70,O70*N70),\"\")","v":""},"",{"$f":"IF(AND(V70=\"\",X70=\"\"),\"\",IF(OR(V70=\"\",X70=\"\"),0,V70-X70))","v":""},"",null,null,0,{"$nulls":3},"No"]
[null,52,{"$nulls":5},"",null,"",{"$nulls":4},"",null,"",null,"No",null,"","","","","","","","",null,null,0,{"$nulls":3},"No"]
[null,53,{"$nulls":5},"",null,"",{"$nulls":4},"",null,"",null,"No",null,"","","","","","","","",null,null,0,{"$nulls":3},"No"]
[null,54,{"$nulls":5},"",null,"",{"$nulls":4},"",null,"",null,"No",null,"","","","","","","","",null,null,0,{"$nulls":3},"No",{"$nulls":6},"","",null,""]
[null,55,{"$nulls":5},"",null,"",{"$nulls":4},"",null,"",null,"No",null,"","","","","","","","",null,null,0,{"$nulls":3},"No"]
[null,56,{"$nulls":5},"",null,"",{"$nulls":4},"",null,"",null,"No",null,"","","","","","","","",null,null,0,{"$nulls":3},"No"]
[null,57,{"$nulls":5},"",null,"",{"$nulls":4},"",null,"",null,"No",null,"","","","","","","","",null,null,0,{"$nulls":3},"No"]
[null,58,{"$nulls":5},"",null,"",{"$nulls":4},"",null,"",null,"No",null,"","","","","","","","",null,null,0,{"$nulls":3},"No"]
[null,59,{"$nulls":5},"",null,"",{"$nulls":4},"",null,"",null,"No",null,"","","","","","","","",null,null,0,{"$nulls":3},"No"]
[null,60,{"$nulls":5},"",null,"",{"$nulls":4},"",null,"",null,"No",null,"","","","","","","","",null,null,0,{"$nulls":3},"No",{"$nulls":6},"","",null,""]
[null,61,{"$nulls":5},"",null,"",{"$nulls":4},"",null,"",null,"No",null,"","","","","","","","",null,null,0,{"$nulls":3},"No"]
[null,62,{"$nulls":5},"",null,"",{"$nulls":4},"",null,"",null,"No",null,"","","","","","","","",null,null,0,{"$nulls":3},"No"]
[null,63,{"$nulls":5},"",null,"",{"$nulls":4},"",null,"",null,"No",null,"","","","","","","","",null,null,0,{"$nulls":3},"No"]
[null,64,{"$nulls":5},"",null,"",{"$nulls":4},"",null,"",null,"No",null,"","","","","","","","",null,null,0,{"$nulls":3},"No"]
[null,65,{"$nulls":5},{"$f":"IF(E84=\"\",\"\",VLOOKUP(E84,$AO$1114:$AP$1541,2,FALSE))","v":""},null,{"$f":"IF(AND(E84<>\"\",G84<>\"\",$E$8=\"Default Sector Hours\"),VLOOKUP(IF(R84=\"Exterior\",\"Exterior\",$E$7),$V$1036:$W$1041,2,FALSE),\"\")","v":""},{"$nulls":4},{"$f":"IF(L84=\"\",\"\",VLOOKUP(L84,$AO$1113:$AP$1541,2,FALSE))","v":""},null,"",null,"No",null,"",{"$f":"IFERROR(IF(E84=\"\",\"\",G84/1000*IF(OR(I84>0,H84=\"Enter Watts\"),I84,H84)*IF(R84=\"Exterior\",$W$1041*(1-$G$15),IF($E$8=\"Manual Input\",J84,VLOOKUP($E$7,$V$1036:$Y$1040,2,FALSE))*(1-$E$15)      )),\"0\")","v":""},"",{"$f":"IFERROR(IF(AND(L84=\"\", E84=\"\"),\"\",N84/1000*IF(OR(P84>0,O84=\"Enter Watts\"),P84,O84)*IF(R84=\"Exterior\",$W$1041,IF($E$8=\"Manual Input\",Q84,VLOOKUP($E$7,$V$1036:$Y$1040,2,FALSE)))*IF(S84=\"Yes\",IF(R84=\"Exterior\",1-$Y$1041,1-VLOOKUP($E$7,$V$1036:$Y$1040,4,FALSE)),1)),0)","v":""},"","","",{"$f":"IF(AA84=\"\",\"\",IF(AND(R84=\"Interior\",S84=\"No\",OR(T84=\"\",T84=\"No\")),$J$1027,IF(AND(R84=\"Interior\",S84=\"Yes\"),$J$1028,IF(AND(R84=\"Exterior\",S84=\"Yes\"),$J$1029,IF(AND(R84=\"Exterior\",S84=\"No\",N84<>G84),\"DNQ\",\"See Lighting Catalog to determine Code\")))))","v":""},null,null,0,{"$nulls":3},"No"]
[null,66,{"$nulls":5},"",null,"",{"$nulls":4},"",null,"",null,"No",null,{"$f":"IF(R85=\"Interior\",IF(E85=\"\",\"\",IF(OR(I85>0,H85=\"Enter Watts\"),I85*G85/1000*(1-$E$15),H85*G85/1000*(1-$E$15))),IF(E85=\"\",\"\",0))","v":""},"",{"$f":"IF(R85=\"Interior\",IF(AND(L85=\"\", E85=\"\"),\"\",IF(OR(P85>0,O85=\"Enter Watts\", P85=\"\"),P85*N85*(1-$Z$1036)/1000,O85*N85*(1-$Z$1036)/1000)),IF(AND(E85=\"\",L85=\"\"),\"\",0))","v":""},"","",{"$f":"IF(AND(U85=\"\",W85=\"\"),\"\",IF(OR(U85=\"\",W85=\"\"),0,  IF($E$8=\"Manual Input\",$G$9,   VLOOKUP($E$7,$V$1036:$Y$1041,3,FALSE))     *(U85-W85)))","v":""},"","",null,null,{"$f":"AD85*N85","v":0},{"$nulls":3},{"$f":"IF(_xlfn.ISFORMULA(J85)=TRUE,\"No\",\"Yes\")","v":"No"}]
[null,67,{"$nulls":5},"",null,"",{"$nulls":4},"",null,"",null,"No",null,"","","","","","","","",null,null,0,{"$nulls":3},"No",{"$nulls":6},"","",null,""]
[null,68,{"$nulls":5},"",null,"",{"$nulls":4},"",null,"",null,"No",null,"","","","","","","","",null,null,0,{"$nulls":3},"No"]
[null,69,{"$nulls":5},"",null,"",{"$nulls":4},"",null,"",null,"No",null,"","","","","","","","",null,null,0,{"$nulls":3},"No"]
[null,70,{"$nulls":5},"",null,"",{"$nulls":4},"",null,"",null,"No",null,"","","","","","","","",null,null,0,{"$nulls":3},"No"]
[null,71,{"$nulls":5},"",null,"",{"$nulls":4},"",null,"",null,"No",null,"","","","","","","","",null,null,0,{"$nulls":3},"No"]
[null,72,{"$nulls":5},"",null,"",{"$nulls":4},"",null,"",null,"No",null,"","","","","","","","",null,null,0,{"$nulls":3},"No"]
[null,73,{"$nulls":5},"",null,"",{"$nulls":4},"",null,"",null,"No",null,"","","","","","","","",null,null,0,{"$nulls":3},"No",{"$nulls":6},"","",null,""]
[null,74,{"$nulls":5},"",null,"",{"$nulls":4},"",null,"",null,"No",null,"","","","","","","","",null,null,0,{"$nulls":3},"No"]
[null,75,{"$nulls":5},"",null,"",{"$nulls":4},"",null,"",null,"No",null,"","","","","","","","",null,null,0,{"$nulls":3},"No"]
[null,76,{"$nulls":5},"",null,"",{"$nulls":4},"",null,"",null,"No",null,"","","","","","","","",null,null,0,{"$nulls":3},"No"]
[null,77,{"$nulls":5},"",null,"",{"$nulls":4},"",null,"",null,"No",null,"","","","","","","","",null,null,0,{"$nulls":3},"No"]
[null,78,{"$nulls":5},"",null,"",{"$nulls":4},"",null,"",null,"No",null,"","","","","","","","",null,null,0,{"$nulls":3},"No"]
[null,79,{"$nulls":5},"",null,"",{"$nulls":4},"",null,"",null,"No",null,"","","","","","","","",null,null,0,{"$nulls":3},"No"]
[null,80,{"$nulls":5},"",null,"",{"$nulls":4},"",null,"",null,"No",null,"","","","","","","","",null,null,0,{"$nulls":3},"No"]
[null,81,{"$nulls":5},"",null,"",{"$nulls":4},"",null,"",null,"No",null,"","","","","","","","",null,null,0,{"$nulls":3},"No"]
[null,82,{"$nulls":5},"",null,"",{"$nulls":4},"",null,"",null,"No",null,"","","","","","","","",null,null,0,{"$nulls":3},"No"]
[null,83,{"$nulls":5},"",null,"",{"$nulls":4},"",null,"",null,"No",null,"","","","","","","","",null,null,0,{"$nulls":3},"No"]
[null,84,{"$nulls":5},"",null,"",{"$nulls":4},"",null,"",null,"No",null,"","","","","","","","",null,null,0,{"$nulls":3},"No"]
[null,85,{"$nulls":5},"",null,"",{"$nulls":4},"",null,"",null,"No",null,"","","","","","","","",null,null,0,{"$nulls":3},"No",{"$nulls":6},"","",null,""]
[null,86,{"$nulls":5},"",null,"",{"$nulls":4},"",null,"",null,"No",null,"","","","","","","","",null,null,0,{"$nulls":3},"No"]
[null,87,{"$nulls":5},"",null,"",{"$nulls":4},"",null,"",null,"No",null,"","","","","","","","",null,null,0,{"$nulls":3},"No"]
[null,88,{"$nulls":5},"",null,"",{"$nulls":4},"",null,"",null,"No",null,"","","","","","","","",null,null,0,{"$nulls":3},"No"]
[null,89,{"$nulls":5},"",null,"",{"$nulls":4},"",null,"",null,"No",null,"","","","","","","","",null,null,0,{"$nulls":3},"No"]
[null,90,{"$nulls":5},"",null,"",{"$nulls":4},"",null,"",null,"No",null,"","","","","","","","",null,null,0,{"$nulls":3},"No"]
[null,91,{"$nulls":5},"",null,"",{"$nulls":4},"",null,"",null,"No",null,"","","","","","","","",null,null,0,{"$nulls":3},"No",{"$nulls":6},"","",null,""]
[null,92,{"$nulls":5},"",null,"",{"$nulls":4},"",null,"",null,"No",null,"","","","","","","","",null,null,0,{"$nulls":3},"No"]
[null,93,{"$nulls":5},"",null,"",{"$nulls":4},"",null,"",null,"No",null,"","","","","","","","",null,null,0,{"$nulls":3},"No"]
[null,94,{"$nulls":5},"",null,"",{"$nulls":4},"",null,"",null,"No",null,"","","","","","","","",null,null,0,{"$nulls":3},"No"]
[null,95,{"$nulls":5},"",null,"",{"$nulls":4},"",null,"",null,"No",null,"","","","","","","","",null,null,0,{"$nulls":3},"No"]
[null,96,{"$nulls":5},"",null,"",{"$nulls":4},"",null,"",null,"No",null,"","","","","","","","",null,null,0,{"$nulls":3},"No"]
[null,97,{"$nulls":5},"",null,"",{"$nulls":4},"",null,"",null,"No",null,"","","","","","","","",null,null,0,{"$nulls":3},"No"]
[null,98,{"$nulls":5},"",null,"",{"$nulls":4},"",null,"",null,"No",null,"","","","",{"$f":"IFERROR(IF(OR(I117>0,H117=\"Enter Watts\"),I117*G117,H117*G117)-IF(OR(P117>0,O117=\"Enter Watts\"),P117*N117,O117*N117),\"\")","v":""},"",{"$f":"IF(AND(V117=\"\",X117=\"\"),\"\",IF(OR(V117=\"\",X117=\"\"),0,V117-X117))","v":""},"",null,null,0,{"$nulls":3},"No"]
[null,99,{"$nulls":5},"",null,"",{"$nulls":4},"",null,"",null,"No",null,"","","","",{"$f":"IFERROR(IF(OR(I118>0,H118=\"Enter Watts\"),I118*G118,H118*G118)-IF(OR(P118>0,O118=\"Enter Watts\"),P118*N118,O118*N118),\"\")","v":""},"",{"$f":"IF(AND(V118=\"\",X118=\"\"),\"\",IF(OR(V118=\"\",X118=\"\"),0,V118-X118))","v":""},"",null,null,0,{"$nulls":3},"No"]
[null,100,{"$nulls":5},"",null,"",{"$nulls":4},"",null,"",null,"No",null,"","","","","","","","",null,null,0,{"$nulls":3},"No"]
[null,101,{"$nulls":5},"",null,"",{"$nulls":4},"",null,"",null,"No",null,"","","","","","","","",null,null,0,{"$nulls":3},"No"]
[null,102,{"$nulls":5},"",null,"",{"$nulls":4},"",null,"",null,"No",null,"","","","","","","","",null,null,0,{"$nulls":3},"No",{"$nulls":6},"","",null,""]
[null,103,{"$nulls":5},"",null,"",{"$nulls":4},"",null,"",null,"No",null,"","","","","","","","",null,null,0,{"$nulls":3},"No"]
[null,104,{"$nulls":5},"",null,"",{"$nulls":4},"",null,"",null,"No",null,"","","","","","","","",null,null,0,{"$nulls":3},"No"]
[null,105,{"$nulls":5},"",null,"",{"$nulls":4},"",null,"",null,"No",null,"","","","","","","","",null,null,0,{"$nulls":3},"No"]
[null,106,{"$nulls":5},"",null,"",{"$nulls":4},"",null,"",null,"No",null,"","","","","","","","",null,null,0,{"$nulls":3},"No"]
[null,107,{"$nulls":5},"",null,"",{"$nulls":4},"",null,"",null,"No",null,"","","","","","","","",null,null,0,{"$nulls":3},"No"]
[null,108,{"$nulls":5},"",null,"",{"$nulls":4},"",null,"",null,"No",null,"","","","",{"$f":"IFERROR(IF(OR(I127>0,H127=\"Enter Watts\"),I127*G127,H127*G127)-IF(OR(P127>0,O127=\"Enter Watts\"),P127*N127,O127*N127),\"\")","v":""},"",{"$f":"IF(AND(V127=\"\",X127=\"\"),\"\",IF(OR(V127=\"\",X127=\"\"),0,V127-X127))","v":""},"",null,null,0,{"$nulls":3},"No"]
[null,109,{"$nulls":5},"",null,"",{"$nulls":4},"",null,"",null,"No",null,"","","","",{"$f":"IFERROR(IF(OR(I128>0,H128=\"Enter Watts\"),I128*G128,H128*G128)-IF(OR(P128>0,O128=\"Enter Watts\"),P128*N128,O128*N128),\"\")","v":""},"",{"$f":"IF(AND(V128=\"\",X128=\"\"),\"\",IF(OR(V128=\"\",X128=\"\"),0,V128-X128))","v":""},"",null,null,0,{"$nulls":3},"No"]
[null,110,{"$nulls":5},"",null,"",{"$nulls":4},"",null,"",null,"No",null,"","","","","","","","",null,null,0,{"$nulls":3},"No"]
[null,111,{"$nulls":5},"",null,"",{"$nulls":4},"",null,"",null,"No",null,"","","","","","","","",null,null,0,{"$nulls":3},"No"]
[null,112,{"$nulls":5},"",null,"",{"$nulls":4},"",null,"",null,"No",null,"","","","","","","","",null,null,0,{"$nulls":3},"No",{"$nulls":6},"","",null,""]
[null,113,{"$nulls":5},"",null,"",{"$nulls":4},"",null,"",null,"No",null,"","","","","","","","",null,null,0,{"$nulls":3},"No"]
[null,114,{"$nulls":5},"",null,"",{"$nulls":4},"",null,"",null,"No",null,"","","","","","","","",null,null,0,{"$nulls":3},"No"]
[null,115,{"$nulls":5},"",null,"",{"$nulls":4},"",null,"",null,"No",null,"","","","","","","","",null,null,0,{"$nulls":3},"No"]
[null,116,{"$nulls":5},"",null,"",{"$nulls":4},"",null,"",null,"No",null,"","","","","","","","",null,null,0,{"$nulls":3},"No"]
[null,117,{"$nulls":5},"",null,"",{"$nulls":4},"",null,"",null,"No",null,"","","","","","","","",null,null,0,{"$nulls":3},"No"]
[null,118,{"$nulls":5},"",null,"",{"$nulls":4},"",null,"",null,"No",null,"","","","","","","","",null,null,0,{"$nulls":3},"No",{"$nulls":6},"","",null,""]
[null,119,{"$nulls":5},"",null,"",{"$nulls":4},"",null,"",null,"No",null,"","","","","","","","",null,null,0,{"$nulls":3},"No"]
[null,120,{"$nulls":5},"",null,"",{"$nulls":4},"",null,"",null,"No",null,"","","","","","","","",null,null,0,{"$nulls":3},"No"]
[null,121,{"$nulls":5},"",null,"",{"$nulls":4},"",null,"",null,"No",null,"","","","","","","","",null,null,0,{"$nulls":3},"No"]
[null,122,{"$nulls":5},"",null,"",{"$nulls":4},"",null,"",null,"No",null,"","","","","","","","",null,null,0,{"$nulls":3},"No"]
[null,123,{"$nulls":5},"",null,"",{"$nulls":4},"",null,"",null,"No",null,"","","","","","","","",null,null,0,{"$nulls":3},"No"]
[null,124,{"$nulls":5},"",null,"",{"$nulls":4},"",null,"",null,"No",null,"","","","","","","","",null,null,0,{"$nulls":3},"No"]
[null,125,{"$nulls":5},"",null,"",{"$nulls":4},"",null,"",null,"No",null,"","","","","","","","",null,null,0,{"$nulls":3},"No",{"$nulls":6},"","",null,""]
[null,126,{"$nulls":5},"",null,"",{"$nulls":4},"",null,"",null,"No",null,"","","","","","","","",null,null,0,{"$nulls":3},"No"]
[null,127,{"$nulls":5},"",null,"",{"$nulls":4},"",null,"",null,"No",null,"","","","","","","","",null,null,0,{"$nulls":3},"No"]
[null,128,{"$nulls":5},"",null,"",{"$nulls":4},"",null,"",null,"No",null,"","","","","","","","",null,null,0,{"$nulls":3},"No"]
[null,129,{"$nulls":5},{"$f":"IF(E148=\"\",\"\",VLOOKUP(E148,$AO$1114:$AP$1541,2,FALSE))","v":""},null,{"$f":"IF(AND(E148<>\"\",G148<>\"\",$E$8=\"Default Sector Hours\"),VLOOKUP(IF(R148=\"Exterior\",\"Exterior\",$E$7),$V$1036:$W$1041,2,FALSE),\"\")","v":""},{"$nulls":4},{"$f":"IF(L148=\"\",\"\",VLOOKUP(L148,$AO$1113:$AP$1541,2,FALSE))","v":""},null,"",null,"No",null,"",{"$f":"IFERROR(IF(E148=\"\",\"\",G148/1000*IF(OR(I148>0,H148=\"Enter Watts\"),I148,H148)*IF(R148=\"Exterior\",$W$1041*(1-$G$15),IF($E$8=\"Manual Input\",J148,VLOOKUP($E$7,$V$1036:$Y$1040,2,FALSE))*(1-$E$15)      )),\"0\")","v":""},"",{"$f":"IFERROR(IF(AND(L148=\"\", E148=\"\"),\"\",N148/1000*IF(OR(P148>0,O148=\"Enter Watts\"),P148,O148)*IF(R148=\"Exterior\",$W$1041,IF($E$8=\"Manual Input\",Q148,VLOOKUP($E$7,$V$1036:$Y$1040,2,FALSE)))*IF(S148=\"Yes\",IF(R148=\"Exterior\",1-$Y$1041,1-VLOOKUP($E$7,$V$1036:$Y$1040,4,FALSE)),1)),0)","v":""},"","","",{"$f":"IF(AA148=\"\",\"\",IF(AND(R148=\"Interior\",S148=\"No\",OR(T148=\"\",T148=\"No\")),$J$1027,IF(AND(R148=\"Interior\",S148=\"Yes\"),$J$1028,IF(AND(R148=\"Exterior\",S148=\"Yes\"),$J$1029,IF(AND(R148=\"Exterior\",S148=\"No\",N148<>G148),\"DNQ\",\"See Lighting Catalog to determine Code\")))))","v":""},null,null,0,{"$nulls":3},"No"]
[null,130,{"$nulls":5},"",null,"",{"$nulls":4},"",null,"",null,"No",null,{"$f":"IF(R149=\"Interior\",IF(E149=\"\",\"\",IF(OR(I149>0,H149=\"Enter Watts\"),I149*G149/1000*(1-$E$15),H149*G149/1000*(1-$E$15))),IF(E149=\"\",\"\",0))","v":""},"",{"$f":"IF(R149=\"Interior\",IF(AND(L149=\"\", E149=\"\"),\"\",IF(OR(P149>0,O149=\"Enter Watts\", P149=\"\"),P149*N149*(1-$Z$1036)/1000,O149*N149*(1-$Z$1036)/1000)),IF(AND(E149=\"\",L149=\"\"),\"\",0))","v":""},"","",{"$f":"IF(AND(U149=\"\",W149=\"\"),\"\",IF(OR(U149=\"\",W149=\"\"),0,  IF($E$8=\"Manual Input\",$G$9,   VLOOKUP($E$7,$V$1036:$Y$1041,3,FALSE))     *(U149-W149)))","v":""},"","",null,null,{"$f":"AD149*N149","v":0},{"$nulls":3},{"$f":"IF(_xlfn.ISFORMULA(J149)=TRUE,\"No\",\"Yes\")","v":"No"}]
[null,131,{"$nulls":5},"",null,"",{"$nulls":4},"",null,"",null,"No",null,"","","","","","","","",null,null,0,{"$nulls":3},"No",{"$nulls":6},"","",null,""]
[null,132,{"$nulls":5},"",null,"",{"$nulls":4},"",null,"",null,"No",null,"","","","","","","","",null,null,0,{"$nulls":3},"No"]
[null,133,{"$nulls":5},"",null,"",{"$nulls":4},"",null,"",null,"No",null,"","","","","","","","",null,null,0,{"$nulls":3},"No"]
[null,134,{"$nulls":5},"",null,"",{"$nulls":4},"",null,"",null,"No",null,"","","","","","","","",null,null,0,{"$nulls":3},"No"]
[null,135,{"$nulls":5},"",null,"",{"$nulls":4},"",null,"",null,"No",null,"","","","","","","","",null,null,0,{"$nulls":3},"No"]
[null,136,{"$nulls":5},"",null,"",{"$nulls":4},"",null,"",null,"No",null,"","","","","","","","",null,null,0,{"$nulls":3},"No"]
[null,137,{"$nulls":5},"",null,"",{"$nulls":4},"",null,"",null,"No",null,"","","","","","","","",null,null,0,{"$nulls":3},"No"]
[null,138,{"$nulls":5},"",null,"",{"$nulls":4},"",null,"",null,"No",null,"","","","","","","","",null,null,0,{"$nulls":3},"No"]
[null,139,{"$nulls":5},"",null,"",{"$nulls":4},"",null,"",null,"No",null,"","","","","","","","",null,null,0,{"$nulls":3},"No"]
[null,140,{"$nulls":5},"",null,"",{"$nulls":4},"",null,"",null,"No",null,"","","","","","","","",null,null,0,{"$nulls":3},"No"]
[null,141,{"$nulls":5},"",null,"",{"$nulls":4},"",null,"",null,"No",null,"","","","","","","","",null,null,0,{"$nulls":3},"No"]
[null,142,{"$nulls":5},"",null,"",{"$nulls":4},"",null,"",null,"No",null,"","","","","","","","",null,null,0,{"$nulls":3},"No"]
[null,143,{"$nulls":5},"",null,"",{"$nulls":4},"",null,"",null,"No",null,"","","","","","","","",null,null,0,{"$nulls":3},"No",{"$nulls":6},"","",null,""]
[null,144,{"$nulls":5},"",null,"",{"$nulls":4},"",null,"",null,"No",null,"","","","","","","","",null,null,0,{"$nulls":3},"No"]
[null,145,{"$nulls":5},"",null,"",{"$nulls":4},"",null,"",null,"No",null,"","","","","","","","",null,null,0,{"$nulls":3},"No"]
[null,146,{"$nulls":5},"",null,"",{"$nulls":4},"",null,"",null,"No",null,"","","","","","","","",null,null,0,{"$nulls":3},"No"]
[null,147,{"$nulls":5},"",null,"",{"$nulls":4},"",null,"",null,"No",null,"","","","","","","","",null,null,0,{"$nulls":3},"No"]
[null,148,{"$nulls":5},"",null,"",{"$nulls":4},"",null,"",null,"No",null,"","","","","","","","",null,null,0,{"$nulls":3},"No"]
[null,149,{"$nulls":5},"",null,"",{"$nulls":4},"",null,"",null,"No",null,"","","","","","","","",null,null,0,{"$nulls":3},"No",{"$nulls":6},"","",null,""]
[null,150,{"$nulls":5},"",null,"",{"$nulls":4},"",null,"",null,"No",null,"","","","","","","","",null,null,0,{"$nulls":3},"No"]
[null,151,{"$nulls":5},"",null,"",{"$nulls":4},"",null,"",null,"No",null,"","","","","","","","",null,null,0,{"$nulls":3},"No"]
[null,152,{"$nulls":5},"",null,"",{"$nulls":4},"",null,"",null,"No",null,"","","","","","","","",null,null,0,{"$nulls":3},"No"]
[null,153,{"$nulls":5},"",null,"",{"$nulls":4},"",null,"",null,"No",null,"","","","","","","","",null,null,0,{"$nulls":3},"No"]
[null,154,{"$nulls":5},"",null,"",{"$nulls":4},"",null,"",null,"No",null,"","","","","","","","",null,null,0,{"$nulls":3},"No"]
[null,155,{"$nulls":5},"",null,"",{"$nulls":4},"",null,"",null,"No",null,"","","","","","","","",null,null,0,{"$nulls":3},"No"]
[null,156,{"$nulls":5},"",null,"",{"$nulls":4},"",null,{"$f":"IF(J175=\"\",\"\",J175)","v":""},null,"No",null,"","","","",{"$f":"IFERROR(IF(OR(I175>0,H175=\"Enter Watts\"),I175*G175,H175*G175)-IF(OR(P175>0,O175=\"Enter Watts\"),P175*N175,O175*N175),\"\")","v":""},"",{"$f":"IF(AND(V175=\"\",X175=\"\"),\"\",IF(OR(V175=\"\",X175=\"\"),0,V175-X175))","v":""},"",null,null,0,{"$nulls":3},"No"]
[null,157,{"$nulls":5},"",null,"",{"$nulls":4},"",null,"",null,"No",null,"","","","",{"$f":"IFERROR(IF(OR(I176>0,H176=\"Enter Watts\"),I176*G176,H176*G176)-IF(OR(P176>0,O176=\"Enter Watts\"),P176*N176,O176*N176),\"\")","v":""},"",{"$f":"IF(AND(V176=\"\",X176=\"\"),\"\",IF(OR(V176=\"\",X176=\"\"),0,V176-X176))","v":""},"",null,null,0,{"$nulls":3},"No"]
[null,158,{"$nulls":5},"",null,"",{"$nulls":4},"",null,"",null,"No",null,"","","","","","","","",null,null,0,{"$nulls":3},"No"]
[null,159,{"$nulls":5},"",null,"",{"$nulls":4},"",null,"",null,"No",null,"","","","","","","","",null,null,0,{"$nulls":3},"No"]
[null,160,{"$nulls":5},"",null,"",{"$nulls":4},"",null,"",null,"No",null,"","","","","","","","",null,null,0,{"$nulls":3},"No",{"$nulls":6},"","",null,""]
[null,161,{"$nulls":5},"",null,"",{"$nulls":4},"",null,"",null,"No",null,"","","","","","","","",null,null,0,{"$nulls":3},"No"]
[null,162,{"$nulls":5},"",null,"",{"$nulls":4},"",null,"",null,"No",null,"","","","","","","","",null,null,0,{"$nulls":3},"No"]
[null,163,{"$nulls":5},"",null,"",{"$nulls":4},"",null,"",null,"No",null,"","","","","","","","",null,null,0,{"$nulls":3},"No"]
[null,164,{"$nulls":5},"",null,"",{"$nulls":4},"",null,"",null,"No",null,"","","","","","","","",null,null,0,{"$nulls":3},"No"]
[null,165,{"$nulls":5},"",null,"",{"$nulls":4},"",null,"",null,"No",null,"","","","","","","","",null,null,0,{"$nulls":3},"No"]
[null,166,{"$nulls":5},"",null,"",{"$nulls":4},"",null,"",null,"No",null,"","","","","","","","",null,null,0,{"$nulls":3},"No",{"$nulls":6},"","",null,""]
[null,167,{"$nulls":5},"",null,"",{"$nulls":4},"",null,"",null,"No",null,"","","","","","","","",null,null,0,{"$nulls":3},"No"]
[null,168,{"$nulls":5},"",null,"",{"$nulls":4},"",null,"",null,"No",null,"","","","","","","","",null,null,0,{"$nulls":3},"No"]
[null,169,{"$nulls":5},"",null,"",{"$nulls":4},"",null,"",null,"No",null,"","","","","","","","",null,null,0,{"$nulls":3},"No"]
[null,170,{"$nulls":5},"",null,"",{"$nulls":4},"",null,"",null,"No",null,"","","","","","","","",null,null,0,{"$nulls":3},"No"]
[null,171,{"$nulls":5},"",null,"",{"$nulls":4},"",null,"",null,"No",null,"","","","","","","","",null,null,0,{"$nulls":3},"No"]
[null,172,{"$nulls":5},"",null,"",{"$nulls":4},"",null,"",null,"No",null,"","","","","","","","",null,null,0,{"$nulls":3},"No"]
[null,173,{"$nulls":5},"",null,"",{"$nulls":4},"",null,"",null,"No",null,"","","","","","","","",null,null,0,{"$nulls":3},"No",{"$nulls":6},"","",null,""]
[null,174,{"$nulls":5},"",null,"",{"$nulls":4},"",null,"",null,"No",null,"","","","","","","","",null,null,0,{"$nulls":3},"No"]
[null,175,{"$nulls":5},"",null,"",{"$nulls":4},"",null,"",null,"No",null,"","","","","","","","",null,null,0,{"$nulls":3},"No"]
[null,176,{"$nulls":5},"",null,"",{"$nulls":4},"",null,"",null,"No",null,"","","","","","","","",null,null,0,{"$nulls":3},"No"]
[null,177,{"$nulls":5},"",null,"",{"$nulls":4},"",null,"",null,"No",null,"","","","","","","","",null,null,0,{"$nulls":3},"No"]
[null,178,{"$nulls":5},"",null,"",{"$nulls":4},"",null,"",null,"No",null,"","","","","","","","",null,null,0,{"$nulls":3},"No"]
[null,179,{"$nulls":5},"",null,"",{"$nulls":4},"",null,"",null,"No",null,"","","","","","","","",null,null,0,{"$nulls":3},"No",{"$nulls":6},"","",null,""]
[null,180,{"$nulls":5},"",null,"",{"$nulls":4},"",null,"",null,"No",null,"","","","","","","","",null,null,0,{"$nulls":3},"No"]
[null,181,{"$nulls":5},"",null,"",{"$nulls":4},"",null,"",null,"No",null,"","","","","","","","",null,null,0,{"$nulls":3},"No"]
[null,182,{"$nulls":5},"",null,"",{"$nulls":4},"",null,"",null,"No",null,"","","","","","","","",null,null,0,{"$nulls":3},"No"]
[null,183,{"$nulls":5},"",null,"",{"$nulls":4},"",null,"",null,"No",null,"","","","","","","","",null,null,0,{"$nulls":3},"No"]
[null,184,{"$nulls":5},"",null,"",{"$nulls":4},"",null,"",null,"No",null,"","","","","","","","",null,null,0,{"$nulls":3},"No"]
[null,185,{"$nulls":5},"",null,"",{"$nulls":4},"",null,"",null,"No",null,"","","","","","","","",null,null,0,{"$nulls":3},"No"]
[null,186,{"$nulls":5},"",null,"",{"$nulls":4},"",null,"",null,"No",null,"","","","","","","","",null,null,0,{"$nulls":3},"No"]
[null,187,{"$nulls":5},"",null,"",{"$nulls":4},"",null,"",null,"No",null,"","","","","","","","",null,null,0,{"$nulls":3},"No"]
[null,188,{"$nulls":5},"",null,"",{"$nulls":4},"",null,"",null,"No",null,"","","","","","","","",null,null,0,{"$nulls":3},"No"]
[null,189,{"$nulls":5},"",null,"",{"$nulls":4},"",null,"",null,"No",null,"","","","","","","","",null,null,0,{"$nulls":3},"No"]
[null,190,{"$nulls":5},"",null,"",{"$nulls":4},"",null,"",null,"No",null,"","","","","","","","",null,null,0,{"$nulls":3},"No"]
[null,191,{"$nulls":5},"",null,"",{"$nulls":4},"",null,"",null,"No",null,"","","","","","","","",null,null,0,{"$nulls":3},"No",{"$nulls":6},"","",null,""]
[null,192,{"$nulls":5},"",null,"",{"$nulls":4},"",null,"",null,"No",null,"","","","","","","","",null,null,0,{"$nulls":3},"No"]
[null,193,{"$nulls":5},{"$f":"IF(E212=\"\",\"\",VLOOKUP(E212,$AO$1114:$AP$1541,2,FALSE))","v":""},null,{"$f":"IF(AND(E212<>\"\",G212<>\"\",$E$8=\"Default Sector Hours\"),VLOOKUP(IF(R212=\"Exterior\",\"Exterior\",$E$7),$V$1036:$W$1041,2,FALSE),\"\")","v":""},{"$nulls":4},{"$f":"IF(L212=\"\",\"\",VLOOKUP(L212,$AO$1113:$AP$1541,2,FALSE))","v":""},null,"",null,"No",null,"",{"$f":"IFERROR(IF(E212=\"\",\"\",G212/1000*IF(OR(I212>0,H212=\"Enter Watts\"),I212,H212)*IF(R212=\"Exterior\",$W$1041*(1-$G$15),IF($E$8=\"Manual Input\",J212,VLOOKUP($E$7,$V$1036:$Y$1040,2,FALSE))*(1-$E$15)      )),\"0\")","v":""},"",{"$f":"IFERROR(IF(AND(L212=\"\", E212=\"\"),\"\",N212/1000*IF(OR(P212>0,O212=\"Enter Watts\"),P212,O212)*IF(R212=\"Exterior\",$W$1041,IF($E$8=\"Manual Input\",Q212,VLOOKUP($E$7,$V$1036:$Y$1040,2,FALSE)))*IF(S212=\"Yes\",IF(R212=\"Exterior\",1-$Y$1041,1-VLOOKUP($E$7,$V$1036:$Y$1040,4,FALSE)),1)),0)","v":""},"","","",{"$f":"IF(AA212=\"\",\"\",IF(AND(R212=\"Interior\",S212=\"No\",OR(T212=\"\",T212=\"No\")),$J$1027,IF(AND(R212=\"Interior\",S212=\"Yes\"),$J$1028,IF(AND(R212=\"Exterior\",S212=\"Yes\"),$J$1029,IF(AND(R212=\"Exterior\",S212=\"No\",N212<>G212),\"DNQ\",\"See Lighting Catalog to determine Code\")))))","v":""},null,null,0,{"$nulls":3},"No"]
[null,194,{"$nulls":5},"",null,"",{"$nulls":4},"",null,"",null,"No",null,{"$f":"IF(R213=\"Interior\",IF(E213=\"\",\"\",IF(OR(I213>0,H213=\"Enter Watts\"),I213*G213/1000*(1-$E$15),H213*G213/1000*(1-$E$15))),IF(E213=\"\",\"\",0))","v":""},"",{"$f":"IF(R213=\"Interior\",IF(AND(L213=\"\", E213=\"\"),\"\",IF(OR(P213>0,O213=\"Enter Watts\", P213=\"\"),P213*N213*(1-$Z$1036)/1000,O213*N213*(1-$Z$1036)/1000)),IF(AND(E213=\"\",L213=\"\"),\"\",0))","v":""},"","",{"$f":"IF(AND(U213=\"\",W213=\"\"),\"\",IF(OR(U213=\"\",W213=\"\"),0,  IF($E$8=\"Manual Input\",$G$9,   VLOOKUP($E$7,$V$1036:$Y$1041,3,FALSE))     *(U213-W213)))","v":""},"","",null,null,{"$f":"AD213*N213","v":0},{"$nulls":3},{"$f":"IF(_xlfn.ISFORMULA(J213)=TRUE,\"No\",\"Yes\")","v":"No"}]
[null,195,{"$nulls":5},"",null,"",{"$nulls":4},"",null,"",null,"No",null,"","","","","","","","",null,null,0,{"$nulls":3},"No"]
[null,196,{"$nulls":5},"",null,"",{"$nulls":4},"",null,"",null,"No",null,"","","","","","","","",null,null,0,{"$nulls":3},"No"]
[null,197,{"$nulls":5},"",null,"",{"$nulls":4},"",null,"",null,"No",null,"","","","","","","","",null,null,0,{"$nulls":3},"No",{"$nulls":6},"","",null,""]
[null,198,{"$nulls":5},"",null,"",{"$nulls":4},"",null,"",null,"No",null,"","","","","","","","",null,null,0,{"$nulls":3},"No"]
[null,199,{"$nulls":5},"",null,"",{"$nulls":4},"",null,"",null,"No",null,"","","","","","","","",null,null,0,{"$nulls":3},"No"]
[null,200,{"$nulls":5},"",null,"",{"$nulls":4},"",null,"",null,"No",null,"","","","","","","","",null,null,0,{"$nulls":3},"No"]
[null,201,{"$nulls":5},"",null,"",{"$nulls":4},"",null,"",null,"No",null,"","","","","","","","",null,null,0,{"$nulls":3},"No"]
[null,202,{"$nulls":5},"",null,"",{"$nulls":4},"",null,"",null,"No",null,"","","","","","","","",null,null,0,{"$nulls":3},"No"]
[null,203,{"$nulls":5},"",null,"",{"$nulls":4},"",null,"",null,"No",null,"","","","","","","","",null,null,0,{"$nulls":3},"No"]
[null,204,{"$nulls":5},"",null,"",{"$nulls":4},"",null,{"$f":"IF(J223=\"\",\"\",J223)","v":""},null,"No",null,"","","","",{"$f":"IFERROR(IF(OR(I223>0,H223=\"Enter Watts\"),I223*G223,H223*G223)-IF(OR(P223>0,O223=\"Enter Watts\"),P223*N223,O223*N223),\"\")","v":""},"",{"$f":"IF(AND(V223=\"\",X223=\"\"),\"\",IF(OR(V223=\"\",X223=\"\"),0,V223-X223))","v":""},"",null,null,0,{"$nulls":3},"No"]
[null,205,{"$nulls":5},"",null,"",{"$nulls":4},"",null,"",null,"No",null,"","","","",{"$f":"IFERROR(IF(OR(I224>0,H224=\"Enter Watts\"),I224*G224,H224*G224)-IF(OR(P224>0,O224=\"Enter Watts\"),P224*N224,O224*N224),\"\")","v":""},"",{"$f":"IF(AND(V224=\"\",X224=\"\"),\"\",IF(OR(V224=\"\",X224=\"\"),0,V224-X224))","v":""},"",null,null,0,{"$nulls":3},"No"]
[null,206,{"$nulls":5},"",null,"",{"$nulls":4},"",null,"",null,"No",null,"","","","","","","","",null,null,0,{"$nulls":3},"No"]
[null,207,{"$nulls":5},"",null,"",{"$nulls":4},"",null,"",null,"No",null,"","","","","","","","",null,null,0,{"$nulls":3},"No"]
[null,208,{"$nulls":5},"",null,"",{"$nulls":4},"",null,"",null,"No",null,"","","","","","","","",null,null,0,{"$nulls":3},"No",{"$nulls":6},"","",null,""]
[null,209,{"$nulls":5},"",null,"",{"$nulls":4},"",null,"",null,"No",null,"","","","","","","","",null,null,0,{"$nulls":3},"No"]
[null,210,{"$nulls":5},"",null,"",{"$nulls":4},"",null,"",null,"No",null,"","","","","","","","",null,null,0,{"$nulls":3},"No"]
[null,211,{"$nulls":5},"",null,"",{"$nulls":4},"",null,"",null,"No",null,"","","","","","","","",null,null,0,{"$nulls":3},"No"]
[null,212,{"$nulls":5},"",null,"",{"$nulls":4},"",null,"",null,"No",null,"","","","","","","","",null,null,0,{"$nulls":3},"No"]
[null,213,{"$nulls":5},"",null,"",{"$nulls":4},"",null,"",null,"No",null,"","","","","","","","",null,null,0,{"$nulls":3},"No"]
[null,214,{"$nulls":5},"",null,"",{"$nulls":4},"",null,"",null,"No",null,"","","","","","","","",null,null,0,{"$nulls":3},"No",{"$nulls":6},"","",null,""]
[null,215,{"$nulls":5},"",null,"",{"$nulls":4},"",null,"",null,"No",null,"","","","","","","","",null,null,0,{"$nulls":3},"No"]
[null,216,{"$nulls":5},"",null,"",{"$nulls":4},"",null,"",null,"No",null,"","","","","","","","",null,null,0,{"$nulls":3},"No"]
[null,217,{"$nulls":5},"",null,"",{"$nulls":4},"",null,"",null,"No",null,"","","","","","","","",null,null,0,{"$nulls":3},"No"]
[null,218,{"$nulls":5},"",null,"",{"$nulls":4},"",null,"",null,"No",null,"","","","","","","","",null,null,0,{"$nulls":3},"No"]
[null,219,{"$nulls":5},"",null,"",{"$nulls":4},"",null,"",null,"No",null,"","","","","","","","",null,null,0,{"$nulls":3},"No"]
[null,220,{"$nulls":5},"",null,"",{"$nulls":4},"",null,"",null,"No",null,"","","","","","","","",null,null,0,{"$nulls":3},"No"]
[null,221,{"$nulls":5},"",null,"",{"$nulls":4},"",null,"",null,"No",null,"","","","","","","","",null,null,0,{"$nulls":3},"No",{"$nulls":6},"","",null,""]
[null,222,{"$nulls":5},"",null,"",{"$nulls":4},"",null,"",null,"No",null,"","","","","","","","",null,null,0,{"$nulls":3},"No"]
[null,223,{"$nulls":5},"",null,"",{"$nulls":4},"",null,"",null,"No",null,"","","","","","","","",null,null,0,{"$nulls":3},"No"]
[null,224,{"$nulls":5},"",null,"",{"$nulls":4},"",null,"",null,"No",null,"","","","","","","","",null,null,0,{"$nulls":3},"No"]
[null,225,{"$nulls":5},"",null,"",{"$nulls":4},"",null,"",null,"No",null,"","","","","","","","",null,null,0,{"$nulls":3},"No"]
[null,226,{"$nulls":5},"",null,"",{"$nulls":4},"",null,"",null,"No",null,"","","","","","","","",null,null,0,{"$nulls":3},"No"]
[null,227,{"$nulls":5},"",null,"",{"$nulls":4},"",null,"",null,"No",null,"","","","","","","","",null,null,0,{"$nulls":3},"No",{"$nulls":6},"","",null,""]
[null,228,{"$nulls":5},"",null,"",{"$nulls":4},"",null,"",null,"No",null,"","","","","","","","",null,null,0,{"$nulls":3},"No"]
[null,229,{"$nulls":5},"",null,"",{"$nulls":4},"",null,"",null,"No",null,"","","","","","","","",null,null,0,{"$nulls":3},"No"]
[null,230,{"$nulls":5},"",null,"",{"$nulls":4},"",null,"",null,"No",null,"","","","","","","","",null,null,0,{"$nulls":3},"No"]
[null,231,{"$nulls":5},"",null,"",{"$nulls":4},"",null,"",null,"No",null,"","","","","","","","",null,null,0,{"$nulls":3},"No"]
[null,232,{"$nulls":5},"",null,"",{"$nulls":4},"",null,"",null,"No",null,"","","","","","","","",null,null,0,{"$nulls":3},"No"]
[null,233,{"$nulls":5},"",null,"",{"$nulls":4},"",null,"",null,"No",null,"","","","","","","","",null,null,0,{"$nulls":3},"No"]
[null,234,{"$nulls":5},"",null,"",{"$nulls":4},"",null,"",null,"No",null,"","","","","","","","",null,null,0,{"$nulls":3},"No"]
[null,235,{"$nulls":5},"",null,"",{"$nulls":4},"",null,"",null,"No",null,"","","","","","","","",null,null,0,{"$nulls":3},"No"]
[null,236,{"$nulls":5},"",null,"",{"$nulls":4},"",null,"",null,"No",null,"","","","","","","","",null,null,0,{"$nulls":3},"No"]
[null,237,{"$nulls":5},"",null,"",{"$nulls":4},"",null,"",null,"No",null,"","","","","","","","",null,null,0,{"$nulls":3},"No"]
[null,238,{"$nulls":5},"",null,"",{"$nulls":4},"",null,"",null,"No",null,"","","","","","","","",null,null,0,{"$nulls":3},"No"]
[null,239,{"$nulls":5},"",null,"",{"$nulls":4},"",null,"",null,"No",null,"","","","","","","","",null,null,0,{"$nulls":3},"No",{"$nulls":6},"","",null,""]
[null,240,{"$nulls":5},"",null,"",{"$nulls":4},"",null,"",null,"No",null,"","","","","","","","",null,null,0,{"$nulls":3},"No"]
[null,241,{"$nulls":5},"",null,"",{"$nulls":4},"",null,"",null,"No",null,"","","","","","","","",null,null,0,{"$nulls":3},"No"]
[null,242,{"$nulls":5},"",null,"",{"$nulls":4},"",null,"",null,"No",null,"","","","","","","","",null,null,0,{"$nulls":3},"No"]
[null,243,{"$nulls":5},"",null,"",{"$nulls":4},"",null,"",null,"No",null,"","","","","","","","",null,null,0,{"$nulls":3},"No"]
[null,244,{"$nulls":5},"",null,"",{"$nulls":4},"",null,"",null,"No",null,"","","","","","","","",null,null,0,{"$nulls":3},"No"]
[null,245,{"$nulls":5},"",null,"",{"$nulls":4},"",null,"",null,"No",null,"","","","","","","","",null,null,0,{"$nulls":3},"No",{"$nulls":6},"","",null,""]
[null,246,{"$nulls":5},"",null,"",{"$nulls":4},"",null,"",null,"No",null,"","","","","","","","",null,null,0,{"$nulls":3},"No"]
[null,247,{"$nulls":5},"",null,"",{"$nulls":4},"",null,"",null,"No",null,"","","","","","","","",null,null,0,{"$nulls":3},"No"]
[null,248,{"$nulls":5},"",null,"",{"$nulls":4},"",null,"",null,"No",null,"","","","","","","","",null,null,0,{"$nulls":3},"No"]
[null,249,{"$nulls":5},"",null,"",{"$nulls":4},"",null,"",null,"No",null,"","","","","","","","",null,null,0,{"$nulls":3},"No"]
[null,250,{"$nulls":5},"",null,"",{"$nulls":4},"",null,"",null,"No",null,"","","","","","","","",null,null,0,{"$nulls":3},"No"]
[null,251,{"$nulls":5},"",null,"",{"$nulls":4},"",null,"",null,"No",null,"","","","","","","","",null,null,0,{"$nulls":3},"No"]
[null,252,{"$nulls":5},"",null,"",{"$nulls":4},"",null,"",null,"No",null,"","","","",{"$f":"IFERROR(IF(OR(I271>0,H271=\"Enter Watts\"),I271*G271,H271*G271)-IF(OR(P271>0,O271=\"Enter Watts\"),P271*N271,O271*N271),\"\")","v":""},"",{"$f":"IF(AND(V271=\"\",X271=\"\"),\"\",IF(OR(V271=\"\",X271=\"\"),0,V271-X271))","v":""},"",null,null,0,{"$nulls":3},"No"]
[null,253,{"$nulls":5},"",null,"",{"$nulls":4},"",null,"",null,"No",null,"","","","",{"$f":"IFERROR(IF(OR(I272>0,H272=\"Enter Watts\"),I272*G272,H272*G272)-IF(OR(P272>0,O272=\"Enter Watts\"),P272*N272,O272*N272),\"\")","v":""},"",{"$f":"IF(AND(V272=\"\",X272=\"\"),\"\",IF(OR(V272=\"\",X272=\"\"),0,V272-X272))","v":""},"",null,null,0,{"$nulls":3},"No"]
[null,254,{"$nulls":5},"",null,"",{"$nulls":4},"",null,"",null,"No",null,"","","","","","","","",null,null,0,{"$nulls":3},"No"]
[null,255,{"$nulls":5},"",null,"",{"$nulls":4},"",null,"",null,"No",null,"","","","","","","","",null,null,0,{"$nulls":3},"No"]
[null,256,{"$nulls":5},"",null,"",{"$nulls":4},"",null,"",null,"No",null,"","","","","","","","",null,null,0,{"$nulls":3},"No",{"$nulls":6},"","",null,""]
[null,257,{"$nulls":5},{"$f":"IF(E276=\"\",\"\",VLOOKUP(E276,$AO$1114:$AP$1541,2,FALSE))","v":""},null,{"$f":"IF(AND(E276<>\"\",G276<>\"\",$E$8=\"Default Sector Hours\"),VLOOKUP(IF(R276=\"Exterior\",\"Exterior\",$E$7),$V$1036:$W$1041,2,FALSE),\"\")","v":""},{"$nulls":4},{"$f":"IF(L276=\"\",\"\",VLOOKUP(L276,$AO$1113:$AP$1541,2,FALSE))","v":""},null,"",null,"No",null,"",{"$f":"IFERROR(IF(E276=\"\",\"\",G276/1000*IF(OR(I276>0,H276=\"Enter Watts\"),I276,H276)*IF(R276=\"Exterior\",$W$1041*(1-$G$15),IF($E$8=\"Manual Input\",J276,VLOOKUP($E$7,$V$1036:$Y$1040,2,FALSE))*(1-$E$15)      )),\"0\")","v":""},"",{"$f":"IFERROR(IF(AND(L276=\"\", E276=\"\"),\"\",N276/1000*IF(OR(P276>0,O276=\"Enter Watts\"),P276,O276)*IF(R276=\"Exterior\",$W$1041,IF($E$8=\"Manual Input\",Q276,VLOOKUP($E$7,$V$1036:$Y$1040,2,FALSE)))*IF(S276=\"Yes\",IF(R276=\"Exterior\",1-$Y$1041,1-VLOOKUP($E$7,$V$1036:$Y$1040,4,FALSE)),1)),0)","v":""},"","","",{"$f":"IF(AA276=\"\",\"\",IF(AND(R276=\"Interior\",S276=\"No\",OR(T276=\"\",T276=\"No\")),$J$1027,IF(AND(R276=\"Interior\",S276=\"Yes\"),$J$1028,IF(AND(R276=\"Exterior\",S276=\"Yes\"),$J$1029,IF(AND(R276=\"Exterior\",S276=\"No\",N276<>G276),\"DNQ\",\"See Lighting Catalog to determine Code\")))))","v":""},null,null,0,{"$nulls":3},"No"]
[null,258,{"$nulls":5},"",null,"",{"$nulls":4},"",null,"",null,"No",null,{"$f":"IF(R277=\"Interior\",IF(E277=\"\",\"\",IF(OR(I277>0,H277=\"Enter Watts\"),I277*G277/1000*(1-$E$15),H277*G277/1000*(1-$E$15))),IF(E277=\"\",\"\",0))","v":""},"",{"$f":"IF(R277=\"Interior\",IF(AND(L277=\"\", E277=\"\"),\"\",IF(OR(P277>0,O277=\"Enter Watts\", P277=\"\"),P277*N277*(1-$Z$1036)/1000,O277*N277*(1-$Z$1036)/1000)),IF(AND(E277=\"\",L277=\"\"),\"\",0))","v":""},"","",{"$f":"IF(AND(U277=\"\",W277=\"\"),\"\",IF(OR(U277=\"\",W277=\"\"),0,  IF($E$8=\"Manual Input\",$G$9,   VLOOKUP($E$7,$V$1036:$Y$1041,3,FALSE))     *(U277-W277)))","v":""},"","",null,null,{"$f":"AD277*N277","v":0},{"$nulls":3},{"$f":"IF(_xlfn.ISFORMULA(J277)=TRUE,\"No\",\"Yes\")","v":"No"}]
[null,259,{"$nulls":5},"",null,"",{"$nulls":4},"",null,"",null,"No",null,"","","","","","","","",null,null,0,{"$nulls":3},"No"]
[null,260,{"$nulls":5},"",null,"",{"$nulls":4},"",null,"",null,"No",null,"","","","","","","","",null,null,0,{"$nulls":3},"No"]
[null,261,{"$nulls":5},"",null,"",{"$nulls":4},"",null,"",null,"No",null,"","","","","","","","",null,null,0,{"$nulls":3},"No"]
[null,262,{"$nulls":5},"",null,"",{"$nulls":4},"",null,"",null,"No",null,"","","","","","","","",null,null,0,{"$nulls":3},"No",{"$nulls":6},"","",null,""]
[null,263,{"$nulls":5},"",null,"",{"$nulls":4},"",null,"",null,"No",null,"","","","","","","","",null,null,0,{"$nulls":3},"No"]
[null,264,{"$nulls":5},"",null,"",{"$nulls":4},"",null,"",null,"No",null,"","","","","","","","",null,null,0,{"$nulls":3},"No"]
[null,265,{"$nulls":5},"",null,"",{"$nulls":4},"",null,"",null,"No",null,"","","","","","","","",null,null,0,{"$nulls":3},"No"]
[null,266,{"$nulls":5},"",null,"",{"$nulls":4},"",null,"",null,"No",null,"","","","","","","","",null,null,0,{"$nulls":3},"No"]
[null,267,{"$nulls":5},"",null,"",{"$nulls":4},"",null,"",null,"No",null,"","","","","","","","",null,null,0,{"$nulls":3},"No"]
[null,268,{"$nulls":5},"",null,"",{"$nulls":4},"",null,"",null,"No",null,"","","","","","","","",null,null,0,{"$nulls":3},"No"]
[null,269,{"$nulls":5},"",null,"",{"$nulls":4},"",null,"",null,"No",null,"","","","","","","","",null,null,0,{"$nulls":3},"No",{"$nulls":6},"","",null,""]
[null,270,{"$nulls":5},"",null,"",{"$nulls":4},"",null,"",null,"No",null,"","","","","","","","",null,null,0,{"$nulls":3},"No"]
[null,271,{"$nulls":5},"",null,"",{"$nulls":4},"",null,"",null,"No",null,"","","","","","","","",null,null,0,{"$nulls":3},"No"]
[null,272,{"$nulls":5},"",null,"",{"$nulls":4},"",null,"",null,"No",null,"","","","","","","","",null,null,0,{"$nulls":3},"No"]
[null,273,{"$nulls":5},"",null,"",{"$nulls":4},"",null,"",null,"No",null,"","","","","","","","",null,null,0,{"$nulls":3},"No"]
[null,274,{"$nulls":5},"",null,"",{"$nulls":4},"",null,"",null,"No",null,"","","","","","","","",null,null,0,{"$nulls":3},"No"]
[null,275,{"$nulls":5},"",null,"",{"$nulls":4},"",null,"",null,"No",null,"","","","","","","","",null,null,0,{"$nulls":3},"No",{"$nulls":6},"","",null,""]
[null,276,{"$nulls":5},"",null,"",{"$nulls":4},"",null,"",null,"No",null,"","","","","","","","",null,null,0,{"$nulls":3},"No"]
[null,277,{"$nulls":5},"",null,"",{"$nulls":4},"",null,"",null,"No",null,"","","","","","","","",null,null,0,{"$nulls":3},"No"]
[null,278,{"$nulls":5},"",null,"",{"$nulls":4},"",null,"",null,"No",null,"","","","","","","","",null,null,0,{"$nulls":3},"No"]
[null,279,{"$nulls":5},"",null,"",{"$nulls":4},"",null,"",null,"No",null,"","","","","","","","",null,null,0,{"$nulls":3},"No"]
[null,280,{"$nulls":5},"",null,"",{"$nulls":4},"",null,"",null,"No",null,"","","","","","","","",null,null,0,{"$nulls":3},"No"]
[null,281,{"$nulls":5},"",null,"",{"$nulls":4},"",null,"",null,"No",null,"","","","","","","","",null,null,0,{"$nulls":3},"No"]
[null,282,{"$nulls":5},"",null,"",{"$nulls":4},"",null,"",null,"No",null,"","","","","","","","",null,null,0,{"$nulls":3},"No"]
[null,283,{"$nulls":5},"",null,"",{"$nulls":4},"",null,"",null,"No",null,"","","","","","","","",null,null,0,{"$nulls":3},"No"]
[null,284,{"$nulls":5},"",null,"",{"$nulls":4},"",null,"",null,"No",null,"","","","","","","","",null,null,0,{"$nulls":3},"No"]
[null,285,{"$nulls":5},"",null,"",{"$nulls":4},"",null,"",null,"No",null,"","","","","","","","",null,null,0,{"$nulls":3},"No"]
[null,286,{"$nulls":5},"",null,"",{"$nulls":4},"",null,"",null,"No",null,"","","","","","","","",null,null,0,{"$nulls":3},"No"]
[null,287,{"$nulls":5},"",null,"",{"$nulls":4},"",null,"",null,"No",null,"","","","","","","","",null,null,0,{"$nulls":3},"No",{"$nulls":6},"","",null,""]
[null,288,{"$nulls":5},"",null,"",{"$nulls":4},"",null,"",null,"No",null,"","","","","","","","",null,null,0,{"$nulls":3},"No"]
[null,289,{"$nulls":5},"",null,"",{"$nulls":4},"",null,"",null,"No",null,"","","","","","","","",null,null,0,{"$nulls":3},"No"]
[null,290,{"$nulls":5},"",null,"",{"$nulls":4},"",null,"",null,"No",null,"","","","","","","","",null,null,0,{"$nulls":3},"No"]
[null,291,{"$nulls":5},"",null,"",{"$nulls":4},"",null,"",null,"No",null,"","","","","","","","",null,null,0,{"$nulls":3},"No"]
[null,292,{"$nulls":5},"",null,"",{"$nulls":4},"",null,"",null,"No",null,"","","","","","","","",null,null,0,{"$nulls":3},"No"]
[null,293,{"$nulls":5},"",null,"",{"$nulls":4},"",null,"",null,"No",null,"","","","","","","","",null,null,0,{"$nulls":3},"No",{"$nulls":6},"","",null,""]
[null,294,{"$nulls":5},"",null,"",{"$nulls":4},"",null,"",null,"No",null,"","","","","","","","",null,null,0,{"$nulls":3},"No"]
[null,295,{"$nulls":5},"",null,"",{"$nulls":4},"",null,"",null,"No",null,"","","","","","","","",null,null,0,{"$nulls":3},"No"]
[null,296,{"$nulls":5},"",null,"",{"$nulls":4},"",null,"",null,"No",null,"","","","","","","","",null,null,0,{"$nulls":3},"No"]
[null,297,{"$nulls":5},"",null,"",{"$nulls":4},"",null,"",null,"No",null,"","","","","","","","",null,null,0,{"$nulls":3},"No"]
[null,298,{"$nulls":5},"",null,"",{"$nulls":4},"",null,"",null,"No",null,"","","","","","","","",null,null,0,{"$nulls":3},"No"]
[null,299,{"$nulls":5},"",null,"",{"$nulls":4},"",null,"",null,"No",null,"","","","","","","","",null,null,0,{"$nulls":3},"No"]
[null,300,{"$nulls":5},"",null,"",{"$nulls":4},"",null,"",null,"No",null,"","","","",{"$f":"IFERROR(IF(OR(I319>0,H319=\"Enter Watts\"),I319*G319,H319*G319)-IF(OR(P319>0,O319=\"Enter Watts\"),P319*N319,O319*N319),\"\")","v":""},"",{"$f":"IF(AND(V319=\"\",X319=\"\"),\"\",IF(OR(V319=\"\",X319=\"\"),0,V319-X319))","v":""},"",null,null,0,{"$nulls":3},"No"]
[null,301,{"$nulls":5},{"$f":"IF(E320=\"\",\"\",VLOOKUP(E320,$AO$1114:$AP$1541,2,FALSE))","v":""},null,"",{"$nulls":4},"",null,"",null,"No",null,"","","","",{"$f":"IFERROR(IF(OR(I320>0,H320=\"Enter Watts\"),I320*G320,H320*G320)-IF(OR(P320>0,O320=\"Enter Watts\"),P320*N320,O320*N320),\"\")","v":""},"",{"$f":"IF(AND(V320=\"\",X320=\"\"),\"\",IF(OR(V320=\"\",X320=\"\"),0,V320-X320))","v":""},{"$f":"IF(AA320=\"\",\"\",IF(AND(R320=\"Interior\",S320=\"No\",OR(T320=\"\",T320=\"No\")),$J$1027,IF(AND(R320=\"Interior\",S320=\"Yes\"),$J$1028,IF(AND(R320=\"Exterior\",S320=\"Yes\"),$J$1029,IF(AND(R320=\"Exterior\",S320=\"No\",N320<>G320),\"DNQ\",\"See Lighting Catalog to determine Code\")))))","v":""},null,null,0,{"$nulls":3},"No"]
[null,302,{"$nulls":5},{"$f":"IF(E321=\"\",\"\",VLOOKUP(E321,$AO$1114:$AP$1541,2,FALSE))","v":""},null,"",{"$nulls":4},"",null,{"$f":"IF(J321=\"\",\"\",J321)","v":""},null,"No",null,"","","","",{"$f":"IFERROR(IF(OR(I321>0,H321=\"Enter Watts\"),I321*G321,H321*G321)-IF(OR(P321>0,O321=\"Enter Watts\"),P321*N321,O321*N321),\"\")","v":""},"",{"$f":"IF(AND(V321=\"\",X321=\"\"),\"\",IF(OR(V321=\"\",X321=\"\"),0,V321-X321))","v":""},{"$f":"IF(AA321=\"\",\"\",IF(AND(R321=\"Interior\",S321=\"No\",OR(T321=\"\",T321=\"No\")),$J$1027,IF(AND(R321=\"Interior\",S321=\"Yes\"),$J$1028,IF(AND(R321=\"Exterior\",S321=\"Yes\"),$J$1029,IF(AND(R321=\"Exterior\",S321=\"No\",N321<>G321),\"DNQ\",\"See Lighting Catalog to determine Code\")))))","v":""},null,null,0,{"$nulls":3},"No"]
[null,303,{"$nulls":5},"",null,"",{"$nulls":4},"",null,"",null,"No",null,"","","","",{"$f":"IFERROR(IF(OR(I322>0,H322=\"Enter Watts\"),I322*G322,H322*G322)-IF(OR(P322>0,O322=\"Enter Watts\"),P322*N322,O322*N322),\"\")","v":""},"",{"$f":"IF(AND(V322=\"\",X322=\"\"),\"\",IF(OR(V322=\"\",X322=\"\"),0,V322-X322))","v":""},"",null,null,0,{"$nulls":3},"No"]
[null,304,{"$nulls":5},"",null,"",{"$nulls":4},"",null,"",null,"No",null,"","","","","","","","",null,null,0,{"$nulls":3},"No"]
[null,305,{"$nulls":5},"",null,"",{"$nulls":4},"",null,"",null,"No",null,"","","","","","","","",null,null,0,{"$nulls":3},"No"]
[null,306,{"$nulls":5},"",null,"",{"$nulls":4},"",null,"",null,"No",null,"","","","","","","","",null,null,0,{"$nulls":3},"No",{"$nulls":6},"","",null,""]
[null,307,{"$nulls":5},"",null,"",{"$nulls":4},"",null,"",null,"No",null,"","","","","","","","",null,null,0,{"$nulls":3},"No"]
[null,308,{"$nulls":5},"",null,"",{"$nulls":4},"",null,"",null,"No",null,"","","","","","","","",null,null,0,{"$nulls":3},"No"]
[null,309,{"$nulls":5},"",null,"",{"$nulls":4},"",null,"",null,"No",null,"","","","","","","","",null,null,0,{"$nulls":3},"No"]
[null,310,{"$nulls":5},"",null,"",{"$nulls":4},"",null,"",null,"No",null,"","","","","","","","",null,null,0,{"$nulls":3},"No"]
[null,311,{"$nulls":5},"",null,"",{"$nulls":4},"",null,"",null,"No",null,"","","","","","","","",null,null,0,{"$nulls":3},"No"]
[null,312,{"$nulls":5},"",null,"",{"$nulls":4},"",null,"",null,"No",null,"","","","","","","","",null,null,0,{"$nulls":3},"No",{"$nulls":6},"","",null,""]
[null,313,{"$nulls":5},"",null,"",{"$nulls":4},"",null,"",null,"No",null,"","","","","","","","",null,null,0,{"$nulls":3},"No"]
[null,314,{"$nulls":5},"",null,"",{"$nulls":4},"",null,"",null,"No",null,"","","","","","","","",null,null,0,{"$nulls":3},"No"]
[null,315,{"$nulls":5},"",null,"",{"$nulls":4},"",null,"",null,"No",null,"","","","","","","","",null,null,0,{"$nulls":3},"No"]
[null,316,{"$nulls":5},"",null,"",{"$nulls":4},"",null,"",null,"No",null,"","","","","","","","",null,null,0,{"$nulls":3},"No"]
[null,317,{"$nulls":5},"",null,"",{"$nulls":4},"",null,"",null,"No",null,"","","","","","","","",null,null,0,{"$nulls":3},"No"]
[null,318,{"$nulls":5},"",null,"",{"$nulls":4},"",null,"",null,"No",null,"","","","","","","","",null,null,0,{"$nulls":3},"No"]
[null,319,{"$nulls":5},"",null,"",{"$nulls":4},"",null,"",null,"No",null,"","","","","","","","",null,null,0,{"$nulls":3},"No",{"$nulls":6},"","",null,""]
[null,320,{"$nulls":5},"",null,"",{"$nulls":4},"",null,"",null,"No",null,"","","","","","","","",null,null,0,{"$nulls":3},"No"]
[null,321,{"$nulls":5},"",null,{"$f":"IF(AND(E340<>\"\",G340<>\"\",$E$8=\"Default Sector Hours\"),VLOOKUP(IF(R340=\"Exterior\",\"Exterior\",$E$7),$V$1036:$W$1041,2,FALSE),\"\")","v":""},{"$nulls":4},{"$f":"IF(L340=\"\",\"\",VLOOKUP(L340,$AO$1113:$AP$1541,2,FALSE))","v":""},null,"",null,"No",null,"",{"$f":"IFERROR(IF(E340=\"\",\"\",G340/1000*IF(OR(I340>0,H340=\"Enter Watts\"),I340,H340)*IF(R340=\"Exterior\",$W$1041*(1-$G$15),IF($E$8=\"Manual Input\",J340,VLOOKUP($E$7,$V$1036:$Y$1040,2,FALSE))*(1-$E$15)      )),\"0\")","v":""},"",{"$f":"IFERROR(IF(AND(L340=\"\", E340=\"\"),\"\",N340/1000*IF(OR(P340>0,O340=\"Enter Watts\"),P340,O340)*IF(R340=\"Exterior\",$W$1041,IF($E$8=\"Manual Input\",Q340,VLOOKUP($E$7,$V$1036:$Y$1040,2,FALSE)))*IF(S340=\"Yes\",IF(R340=\"Exterior\",1-$Y$1041,1-VLOOKUP($E$7,$V$1036:$Y$1040,4,FALSE)),1)),0)","v":""},"","","","",null,null,0,{"$nulls":3},"No"]
[null,322,{"$nulls":5},"",null,"",{"$nulls":4},"",null,"",null,"No",null,{"$f":"IF(R341=\"Interior\",IF(E341=\"\",\"\",IF(OR(I341>0,H341=\"Enter Watts\"),I341*G341/1000*(1-$E$15),H341*G341/1000*(1-$E$15))),IF(E341=\"\",\"\",0))","v":""},"",{"$f":"IF(R341=\"Interior\",IF(AND(L341=\"\", E341=\"\"),\"\",IF(OR(P341>0,O341=\"Enter Watts\", P341=\"\"),P341*N341*(1-$Z$1036)/1000,O341*N341*(1-$Z$1036)/1000)),IF(AND(E341=\"\",L341=\"\"),\"\",0))","v":""},"","",{"$f":"IF(AND(U341=\"\",W341=\"\"),\"\",IF(OR(U341=\"\",W341=\"\"),0,  IF($E$8=\"Manual Input\",$G$9,   VLOOKUP($E$7,$V$1036:$Y$1041,3,FALSE))     *(U341-W341)))","v":""},"","",null,null,{"$f":"AD341*N341","v":0},{"$nulls":3},{"$f":"IF(_xlfn.ISFORMULA(J341)=TRUE,\"No\",\"Yes\")","v":"No"}]
[null,323,{"$nulls":5},"",null,"",{"$nulls":4},"",null,"",null,"No",null,"","","","","","","","",null,null,0,{"$nulls":3},"No"]
[null,324,{"$nulls":5},"",null,"",{"$nulls":4},"",null,"",null,"No",null,"","","","","","","","",null,null,0,{"$nulls":3},"No"]
[null,325,{"$nulls":5},"",null,"",{"$nulls":4},"",null,"",null,"No",null,"","","","","","","","",null,null,0,{"$nulls":3},"No",{"$nulls":6},"","",null,""]
[null,326,{"$nulls":5},"",null,"",{"$nulls":4},"",null,"",null,"No",null,"","","","","","","","",null,null,0,{"$nulls":3},"No"]
[null,327,{"$nulls":5},"",null,"",{"$nulls":4},"",null,"",null,"No",null,"","","","","","","","",null,null,0,{"$nulls":3},"No"]
[null,328,{"$nulls":5},"",null,"",{"$nulls":4},"",null,"",null,"No",null,"","","","","","","","",null,null,0,{"$nulls":3},"No"]
[null,329,{"$nulls":5},"",null,"",{"$nulls":4},"",null,"",null,"No",null,"","","","","","","","",null,null,0,{"$nulls":3},"No"]
[null,330,{"$nulls":5},"",null,"",{"$nulls":4},"",null,"",null,"No",null,"","","","","","","","",null,null,0,{"$nulls":3},"No"]
[null,331,{"$nulls":5},"",null,"",{"$nulls":4},"",null,"",null,"No",null,"","","","","","","","",null,null,0,{"$nulls":3},"No"]
[null,332,{"$nulls":5},"",null,"",{"$nulls":4},"",null,"",null,"No",null,"","","","","","","","",null,null,0,{"$nulls":3},"No"]
[null,333,{"$nulls":5},"",null,"",{"$nulls":4},"",null,"",null,"No",null,"","","","","","","","",null,null,0,{"$nulls":3},"No"]
[null,334,{"$nulls":5},"",null,"",{"$nulls":4},"",null,"",null,"No",null,"","","","","","","","",null,null,0,{"$nulls":3},"No"]
[null,335,{"$nulls":5},"",null,"",{"$nulls":4},"",null,"",null,"No",null,"","","","","","","","",null,null,0,{"$nulls":3},"No"]
[null,336,{"$nulls":5},"",null,"",{"$nulls":4},"",null,"",null,"No",null,"","","","","","","","",null,null,0,{"$nulls":3},"No"]
[null,337,{"$nulls":5},"",null,"",{"$nulls":4},"",null,"",null,"No",null,"","","","","","","","",null,null,0,{"$nulls":3},"No",{"$nulls":6},"","",null,""]
[null,338,{"$nulls":5},"",null,"",{"$nulls":4},"",null,"",null,"No",null,"","","","","","","","",null,null,0,{"$nulls":3},"No"]
[null,339,{"$nulls":5},"",null,"",{"$nulls":4},"",null,"",null,"No",null,"","","","","","","","",null,null,0,{"$nulls":3},"No"]
[null,340,{"$nulls":5},"",null,"",{"$nulls":4},"",null,"",null,"No",null,"","","","","","","","",null,null,0,{"$nulls":3},"No"]
[null,341,{"$nulls":5},"",null,"",{"$nulls":4},"",null,"",null,"No",null,"","","","","","","","",null,null,0,{"$nulls":3},"No"]
[null,342,{"$nulls":5},"",null,"",{"$nulls":4},"",null,"",null,"No",null,"","","","","","","","",null,null,0,{"$nulls":3},"No"]
[null,343,{"$nulls":5},"",null,"",{"$nulls":4},"",null,"",null,"No",null,"","","","","","","","",null,null,0,{"$nulls":3},"No",{"$nulls":6},"","",null,""]
[null,344,{"$nulls":5},"",null,"",{"$nulls":4},"",null,"",null,"No",null,"","","","","","","","",null,null,0,{"$nulls":3},"No"]
[null,345,{"$nulls":5},"",null,"",{"$nulls":4},"",null,"",null,"No",null,"","","","","","","","",null,null,0,{"$nulls":3},"No"]
[null,346,{"$nulls":5},"",null,"",{"$nulls":4},"",null,"",null,"No",null,"","","","","","","","",null,null,0,{"$nulls":3},"No"]
[null,347,{"$nulls":5},"",null,"",{"$nulls":4},"",null,"",null,"No",null,"","","","","","","","",null,null,0,{"$nulls":3},"No"]
[null,348,{"$nulls":5},"",null,"",{"$nulls":4},"",null,"",null,"No",null,"","","","","","","","",null,null,0,{"$nulls":3},"No"]
[null,349,{"$nulls":5},"",null,"",{"$nulls":4},"",null,"",null,"No",null,"","","","","","","","",null,null,0,{"$nulls":3},"No"]
[null,350,{"$nulls":5},"",null,"",{"$nulls":4},"",null,"",null,"No",null,"","","","",{"$f":"IFERROR(IF(OR(I369>0,H369=\"Enter Watts\"),I369*G369,H369*G369)-IF(OR(P369>0,O369=\"Enter Watts\"),P369*N369,O369*N369),\"\")","v":""},"",{"$f":"IF(AND(V369=\"\",X369=\"\"),\"\",IF(OR(V369=\"\",X369=\"\"),0,V369-X369))","v":""},"",null,null,0,{"$nulls":3},"No"]
[null,351,{"$nulls":5},"",null,"",{"$nulls":4},"",null,"",null,"No",null,"","","","",{"$f":"IFERROR(IF(OR(I370>0,H370=\"Enter Watts\"),I370*G370,H370*G370)-IF(OR(P370>0,O370=\"Enter Watts\"),P370*N370,O370*N370),\"\")","v":""},"",{"$f":"IF(AND(V370=\"\",X370=\"\"),\"\",IF(OR(V370=\"\",X370=\"\"),0,V370-X370))","v":""},"",null,null,0,{"$nulls":3},"No"]
[null,352,{"$nulls":5},"",null,"",{"$nulls":4},"",null,"",null,"No",null,"","","","","","","","",null,null,0,{"$nulls":3},"No"]
[null,353,{"$nulls":5},"",null,"",{"$nulls":4},"",null,"",null,"No",null,"","","","","","","","",null,null,0,{"$nulls":3},"No"]
[null,354,{"$nulls":5},"",null,"",{"$nulls":4},"",null,"",null,"No",null,"","","","","","","","",null,null,0,{"$nulls":3},"No",{"$nulls":6},"","",null,""]
[null,355,{"$nulls":5},"",null,"",{"$nulls":4},"",null,"",null,"No",null,"","","","","","","","",null,null,0,{"$nulls":3},"No"]
[null,356,{"$nulls":5},"",null,"",{"$nulls":4},"",null,"",null,"No",null,"","","","","","","","",null,null,0,{"$nulls":3},"No"]
[null,357,{"$nulls":5},"",null,"",{"$nulls":4},"",null,"",null,"No",null,"","","","","","","","",null,null,0,{"$nulls":3},"No"]
[null,358,{"$nulls":5},"",null,"",{"$nulls":4},"",null,"",null,"No",null,"","","","","","","","",null,null,0,{"$nulls":3},"No"]
[null,359,{"$nulls":5},"",null,"",{"$nulls":4},"",null,"",null,"No",null,"","","","","","","","",null,null,0,{"$nulls":3},"No"]
[null,360,{"$nulls":5},"",null,"",{"$nulls":4},"",null,"",null,"No",null,"","","","","","","","",null,null,0,{"$nulls":3},"No",{"$nulls":6},"","",null,""]
[null,361,{"$nulls":5},"",null,"",{"$nulls":4},"",null,"",null,"No",null,"","","","","","","","",null,null,0,{"$nulls":3},"No"]
[null,362,{"$nulls":5},"",null,"",{"$nulls":4},"",null,"",null,"No",null,"","","","","","","","",null,null,0,{"$nulls":3},"No"]
[null,363,{"$nulls":5},"",null,"",{"$nulls":4},"",null,"",null,"No",null,"","","","","","","","",null,null,0,{"$nulls":3},"No"]
[null,364,{"$nulls":5},"",null,"",{"$nulls":4},"",null,"",null,"No",null,"","","","","","","","",null,null,0,{"$nulls":3},"No"]
[null,365,{"$nulls":5},"",null,"",{"$nulls":4},"",null,"",null,"No",null,"","","","","","","","",null,null,0,{"$nulls":3},"No"]
[null,366,{"$nulls":5},{"$f":"IF(E385=\"\",\"\",VLOOKUP(E385,$AO$1114:$AP$1541,2,FALSE))","v":""},null,"",{"$nulls":4},"",null,"",null,"No",null,"","","","","","","",{"$f":"IF(AA385=\"\",\"\",IF(AND(R385=\"Interior\",S385=\"No\",OR(T385=\"\",T385=\"No\")),$J$1027,IF(AND(R385=\"Interior\",S385=\"Yes\"),$J$1028,IF(AND(R385=\"Exterior\",S385=\"Yes\"),$J$1029,IF(AND(R385=\"Exterior\",S385=\"No\",N385<>G385),\"DNQ\",\"See Lighting Catalog to determine Code\")))))","v":""},null,null,0,{"$nulls":3},"No"]
[null,367,{"$nulls":5},"",null,"",{"$nulls":4},"",null,"",null,"No",null,"","","","","","","","",null,null,0,{"$nulls":3},"No",{"$nulls":6},"","",null,""]
[null,368,{"$nulls":5},"",null,"",{"$nulls":4},"",null,"",null,"No",null,"","","","","","","","",null,null,0,{"$nulls":3},"No"]
[null,369,{"$nulls":5},"",null,"",{"$nulls":4},"",null,"",null,"No",null,"","","","","","","","",null,null,0,{"$nulls":3},"No"]
[null,370,{"$nulls":5},"",null,"",{"$nulls":4},"",null,"",null,"No",null,"","","","","","","","",null,null,0,{"$nulls":3},"No"]
[null,371,{"$nulls":5},"",null,"",{"$nulls":4},"",null,"",null,"No",null,"","","","","","","","",null,null,0,{"$nulls":3},"No"]
[null,372,{"$nulls":5},"",null,"",{"$nulls":4},"",null,"",null,"No",null,"","","","","","","","",null,null,0,{"$nulls":3},"No"]
[null,373,{"$nulls":5},"",null,"",{"$nulls":4},"",null,"",null,"No",null,"","","","","","","","",null,null,0,{"$nulls":3},"No",{"$nulls":6},"","",null,""]
[null,374,{"$nulls":5},"",null,"",{"$nulls":4},"",null,"",null,"No",null,"","","","","","","","",null,null,0,{"$nulls":3},"No"]
[null,375,{"$nulls":5},"",null,"",{"$nulls":4},"",null,"",null,"No",null,"","","","","","","","",null,null,0,{"$nulls":3},"No"]
[null,376,{"$nulls":5},"",null,"",{"$nulls":4},"",null,"",null,"No",null,"","","","","","","","",null,null,0,{"$nulls":3},"No"]
[null,377,{"$nulls":5},"",null,"",{"$nulls":4},"",null,"",null,"No",null,"","","","","","","","",null,null,0,{"$nulls":3},"No"]
[null,378,{"$nulls":5},"",null,"",{"$nulls":4},"",null,"",null,"No",null,"","","","","","","","",null,null,0,{"$nulls":3},"No"]
[null,379,{"$nulls":5},"",null,"",{"$nulls":4},"",null,"",null,"No",null,"","","","","","","","",null,null,0,{"$nulls":3},"No"]
[null,380,{"$nulls":5},"",null,"",{"$nulls":4},"",null,"",null,"No",null,"","","","","","","","",null,null,0,{"$nulls":3},"No"]
[null,381,{"$nulls":5},"",null,"",{"$nulls":4},"",null,"",null,"No",null,"","","","","","","","",null,null,0,{"$nulls":3},"No"]
[null,382,{"$nulls":5},"",null,"",{"$nulls":4},"",null,"",null,"No",null,"","","","","","","","",null,null,0,{"$nulls":3},"No"]
[null,383,{"$nulls":5},"",null,"",{"$nulls":4},"",null,"",null,"No",null,"","","","","","","","",null,null,0,{"$nulls":3},"No"]
[null,384,{"$nulls":5},"",null,"",{"$nulls":4},"",null,"",null,"No",null,"","","","","","","","",null,null,0,{"$nulls":3},"No"]
[null,385,{"$nulls":5},"",null,{"$f":"IF(AND(E404<>\"\",G404<>\"\",$E$8=\"Default Sector Hours\"),VLOOKUP(IF(R404=\"Exterior\",\"Exterior\",$E$7),$V$1036:$W$1041,2,FALSE),\"\")","v":""},{"$nulls":4},{"$f":"IF(L404=\"\",\"\",VLOOKUP(L404,$AO$1113:$AP$1541,2,FALSE))","v":""},null,"",null,"No",null,"",{"$f":"IFERROR(IF(E404=\"\",\"\",G404/1000*IF(OR(I404>0,H404=\"Enter Watts\"),I404,H404)*IF(R404=\"Exterior\",$W$1041*(1-$G$15),IF($E$8=\"Manual Input\",J404,VLOOKUP($E$7,$V$1036:$Y$1040,2,FALSE))*(1-$E$15)      )),\"0\")","v":""},"",{"$f":"IFERROR(IF(AND(L404=\"\", E404=\"\"),\"\",N404/1000*IF(OR(P404>0,O404=\"Enter Watts\"),P404,O404)*IF(R404=\"Exterior\",$W$1041,IF($E$8=\"Manual Input\",Q404,VLOOKUP($E$7,$V$1036:$Y$1040,2,FALSE)))*IF(S404=\"Yes\",IF(R404=\"Exterior\",1-$Y$1041,1-VLOOKUP($E$7,$V$1036:$Y$1040,4,FALSE)),1)),0)","v":""},"","","","",null,null,0,{"$nulls":3},"No",{"$nulls":6},"","",null,""]
[null,386,{"$nulls":5},"",null,"",{"$nulls":4},"",null,"",null,"No",null,{"$f":"IF(R405=\"Interior\",IF(E405=\"\",\"\",IF(OR(I405>0,H405=\"Enter Watts\"),I405*G405/1000*(1-$E$15),H405*G405/1000*(1-$E$15))),IF(E405=\"\",\"\",0))","v":""},"",{"$f":"IF(R405=\"Interior\",IF(AND(L405=\"\", E405=\"\"),\"\",IF(OR(P405>0,O405=\"Enter Watts\", P405=\"\"),P405*N405*(1-$Z$1036)/1000,O405*N405*(1-$Z$1036)/1000)),IF(AND(E405=\"\",L405=\"\"),\"\",0))","v":""},"","",{"$f":"IF(AND(U405=\"\",W405=\"\"),\"\",IF(OR(U405=\"\",W405=\"\"),0,  IF($E$8=\"Manual Input\",$G$9,   VLOOKUP($E$7,$V$1036:$Y$1041,3,FALSE))     *(U405-W405)))","v":""},"","",null,null,{"$f":"AD405*N405","v":0},{"$nulls":3},{"$f":"IF(_xlfn.ISFORMULA(J405)=TRUE,\"No\",\"Yes\")","v":"No"}]
[null,387,{"$nulls":5},"",null,"",{"$nulls":4},"",null,"",null,"No",null,"","","","","","","","",null,null,0,{"$nulls":3},"No"]
[null,388,{"$nulls":5},"",null,"",{"$nulls":4},"",null,"",null,"No",null,"","","","","","","","",null,null,0,{"$nulls":3},"No"]
[null,389,{"$nulls":5},"",null,"",{"$nulls":4},"",null,"",null,"No",null,"","","","","","","","",null,null,0,{"$nulls":3},"No"]
[null,390,{"$nulls":5},"",null,"",{"$nulls":4},"",null,"",null,"No",null,"","","","","","","","",null,null,0,{"$nulls":3},"No"]
[null,391,{"$nulls":5},"",null,"",{"$nulls":4},"",null,"",null,"No",null,"","","","","","","","",null,null,0,{"$nulls":3},"No",{"$nulls":6},"","",null,""]
[null,392,{"$nulls":5},"",null,"",{"$nulls":4},"",null,"",null,"No",null,"","","","","","","","",null,null,0,{"$nulls":3},"No"]
[null,393,{"$nulls":5},"",null,"",{"$nulls":4},"",null,"",null,"No",null,"","","","","","","","",null,null,0,{"$nulls":3},"No"]
[null,394,{"$nulls":5},"",null,"",{"$nulls":4},"",null,"",null,"No",null,"","","","","","","","",null,null,0,{"$nulls":3},"No"]
[null,395,{"$nulls":5},"",null,"",{"$nulls":4},"",null,"",null,"No",null,"","","","","","","","",null,null,0,{"$nulls":3},"No"]
[null,396,{"$nulls":5},"",null,"",{"$nulls":4},"",null,"",null,"No",null,"","","","","","","","",null,null,0,{"$nulls":3},"No"]
[null,397,{"$nulls":5},"",null,"",{"$nulls":4},"",null,"",null,"No",null,"","","","","","","","",null,null,0,{"$nulls":3},"No"]
[null,398,{"$nulls":5},"",null,"",{"$nulls":4},"",null,"",null,"No",null,"","","","",{"$f":"IFERROR(IF(OR(I417>0,H417=\"Enter Watts\"),I417*G417,H417*G417)-IF(OR(P417>0,O417=\"Enter Watts\"),P417*N417,O417*N417),\"\")","v":""},"",{"$f":"IF(AND(V417=\"\",X417=\"\"),\"\",IF(OR(V417=\"\",X417=\"\"),0,V417-X417))","v":""},"",null,null,0,{"$nulls":3},"No"]
[null,399,{"$nulls":5},"",null,"",{"$nulls":4},"",null,"",null,"No",null,"","","","",{"$f":"IFERROR(IF(OR(I418>0,H418=\"Enter Watts\"),I418*G418,H418*G418)-IF(OR(P418>0,O418=\"Enter Watts\"),P418*N418,O418*N418),\"\")","v":""},"",{"$f":"IF(AND(V418=\"\",X418=\"\"),\"\",IF(OR(V418=\"\",X418=\"\"),0,V418-X418))","v":""},"",null,null,0,{"$nulls":3},"No"]
[null,400,{"$nulls":5},"",null,"",{"$nulls":4},"",null,"",null,"No",null,"","","","","","","","",null,null,0,{"$nulls":3},"No"]
[null,401,{"$nulls":5},"",null,"",{"$nulls":4},"",null,"",null,"No",null,"","","","","","","","",null,null,0,{"$nulls":3},"No"]
[null,402,{"$nulls":5},"",null,"",{"$nulls":4},"",null,"",null,"No",null,"","","","","","","","",null,null,0,{"$nulls":3},"No",{"$nulls":6},"","",null,""]
[null,403,{"$nulls":5},"",null,"",{"$nulls":4},"",null,"",null,"No",null,"","","","","","","","",null,null,0,{"$nulls":3},"No"]
[null,404,{"$nulls":5},"",null,"",{"$nulls":4},"",null,"",null,"No",null,"","","","","","","","",null,null,0,{"$nulls":3},"No"]
[null,405,{"$nulls":5},"",null,"",{"$nulls":4},"",null,"",null,"No",null,"","","","","","","","",null,null,0,{"$nulls":3},"No"]
[null,406,{"$nulls":5},"",null,"",{"$nulls":4},"",null,"",null,"No",null,"","","","","","","","",null,null,0,{"$nulls":3},"No"]
[null,407,{"$nulls":5},"",null,"",{"$nulls":4},"",null,"",null,"No",null,"","","","","","","","",null,null,0,{"$nulls":3},"No"]
[null,408,{"$nulls":5},"",null,"",{"$nulls":4},"",null,"",null,"No",null,"","","","",{"$f":"IFERROR(IF(OR(I427>0,H427=\"Enter Watts\"),I427*G427,H427*G427)-IF(OR(P427>0,O427=\"Enter Watts\"),P427*N427,O427*N427),\"\")","v":""},"",{"$f":"IF(AND(V427=\"\",X427=\"\"),\"\",IF(OR(V427=\"\",X427=\"\"),0,V427-X427))","v":""},"",null,null,0,{"$nulls":3},"No"]
[null,409,{"$nulls":5},"",null,"",{"$nulls":4},"",null,"",null,"No",null,"","","","",{"$f":"IFERROR(IF(OR(I428>0,H428=\"Enter Watts\"),I428*G428,H428*G428)-IF(OR(P428>0,O428=\"Enter Watts\"),P428*N428,O428*N428),\"\")","v":""},"",{"$f":"IF(AND(V428=\"\",X428=\"\"),\"\",IF(OR(V428=\"\",X428=\"\"),0,V428-X428))","v":""},"",null,null,0,{"$nulls":3},"No"]
[null,410,{"$nulls":5},"",null,"",{"$nulls":4},"",null,"",null,"No",null,"","","","","","","","",null,null,0,{"$nulls":3},"No"]
[null,411,{"$nulls":5},"",null,"",{"$nulls":4},"",null,"",null,"No",null,"","","","","","","","",null,null,0,{"$nulls":3},"No"]
[null,412,{"$nulls":5},"",null,"",{"$nulls":4},"",null,"",null,"No",null,"","","","","","","","",null,null,0,{"$nulls":3},"No",{"$nulls":6},"","",null,""]
[null,413,{"$nulls":5},"",null,"",{"$nulls":4},"",null,"",null,"No",null,"","","","","","","","",null,null,0,{"$nulls":3},"No"]
[null,414,{"$nulls":5},"",null,"",{"$nulls":4},"",null,"",null,"No",null,"","","","","","","","",null,null,0,{"$nulls":3},"No"]
[null,415,{"$nulls":5},"",null,"",{"$nulls":4},"",null,"",null,"No",null,"","","","","","","","",null,null,0,{"$nulls":3},"No"]
[null,416,{"$nulls":5},"",null,"",{"$nulls":4},"",null,"",null,"No",null,"","","","","","","","",null,null,0,{"$nulls":3},"No"]
[null,417,{"$nulls":5},"",null,"",{"$nulls":4},"",null,"",null,"No",null,"","","","","","","","",null,null,0,{"$nulls":3},"No"]
[null,418,{"$nulls":5},"",null,"",{"$nulls":4},"",null,"",null,"No",null,"","","","","","","","",null,null,0,{"$nulls":3},"No",{"$nulls":6},"","",null,""]
[null,419,{"$nulls":5},"",null,"",{"$nulls":4},"",null,"",null,"No",null,"","","","","","","","",null,null,0,{"$nulls":3},"No"]
[null,420,{"$nulls":5},"",null,"",{"$nulls":4},"",null,"",null,"No",null,"","","","","","","","",null,null,0,{"$nulls":3},"No"]
[null,421,{"$nulls":5},"",null,"",{"$nulls":4},"",null,"",null,"No",null,"","","","","","","","",null,null,0,{"$nulls":3},"No"]
[null,422,{"$nulls":5},"",null,"",{"$nulls":4},"",null,"",null,"No",null,"","","","","","","","",null,null,0,{"$nulls":3},"No"]
[null,423,{"$nulls":5},"",null,"",{"$nulls":4},"",null,"",null,"No",null,"","","","","","","","",null,null,0,{"$nulls":3},"No"]
[null,424,{"$nulls":5},"",null,"",{"$nulls":4},"",null,"",null,"No",null,"","","","","","","","",null,null,0,{"$nulls":3},"No"]
[null,425,{"$nulls":5},"",null,"",{"$nulls":4},"",null,"",null,"No",null,"","","","","","","","",null,null,0,{"$nulls":3},"No",{"$nulls":6},"","",null,""]
[null,426,{"$nulls":5},"",null,"",{"$nulls":4},"",null,"",null,"No",null,"","","","","","","","",null,null,0,{"$nulls":3},"No"]
[null,427,{"$nulls":5},"",null,"",{"$nulls":4},"",null,"",null,"No",null,"","","","","","","","",null,null,0,{"$nulls":3},"No"]
[null,428,{"$nulls":5},"",null,"",{"$nulls":4},"",null,"",null,"No",null,"","","","","","","","",null,null,0,{"$nulls":3},"No"]
[null,429,{"$nulls":5},"",null,"",{"$nulls":4},"",null,"",null,"No",null,"","","","","","","","",null,null,0,{"$nulls":3},"No"]
[null,430,{"$nulls":5},{"$f":"IF(E449=\"\",\"\",VLOOKUP(E449,$AO$1114:$AP$1541,2,FALSE))","v":""},null,"",{"$nulls":4},"",null,"",null,"No",null,"","","","","","","",{"$f":"IF(AA449=\"\",\"\",IF(AND(R449=\"Interior\",S449=\"No\",OR(T449=\"\",T449=\"No\")),$J$1027,IF(AND(R449=\"Interior\",S449=\"Yes\"),$J$1028,IF(AND(R449=\"Exterior\",S449=\"Yes\"),$J$1029,IF(AND(R449=\"Exterior\",S449=\"No\",N449<>G449),\"DNQ\",\"See Lighting Catalog to determine Code\")))))","v":""},null,null,0,{"$nulls":3},"No"]
[null,431,{"$nulls":5},"",null,"",{"$nulls":4},"",null,"",null,"No",null,"","","","","","","","",null,null,0,{"$nulls":3},"No",{"$nulls":6},"","",null,""]
[null,432,{"$nulls":5},"",null,"",{"$nulls":4},"",null,"",null,"No",null,"","","","","","","","",null,null,0,{"$nulls":3},"No"]
[null,433,{"$nulls":5},"",null,"",{"$nulls":4},"",null,"",null,"No",null,"","","","","","","","",null,null,0,{"$nulls":3},"No"]
[null,434,{"$nulls":5},"",null,"",{"$nulls":4},"",null,"",null,"No",null,"","","","","","","","",null,null,0,{"$nulls":3},"No"]
[null,435,{"$nulls":5},"",null,"",{"$nulls":4},"",null,"",null,"No",null,"","","","","","","","",null,null,0,{"$nulls":3},"No"]
[null,436,{"$nulls":5},"",null,"",{"$nulls":4},"",null,"",null,"No",null,"","","","","","","","",null,null,0,{"$nulls":3},"No"]
[null,437,{"$nulls":5},"",null,"",{"$nulls":4},"",null,"",null,"No",null,"","","","","","","","",null,null,0,{"$nulls":3},"No"]
[null,438,{"$nulls":5},"",null,"",{"$nulls":4},"",null,"",null,"No",null,"","","","","","","","",null,null,0,{"$nulls":3},"No"]
[null,439,{"$nulls":5},"",null,"",{"$nulls":4},"",null,"",null,"No",null,"","","","","","","","",null,null,0,{"$nulls":3},"No"]
[null,440,{"$nulls":5},"",null,"",{"$nulls":4},"",null,"",null,"No",null,"","","","","","","","",null,null,0,{"$nulls":3},"No"]
[null,441,{"$nulls":5},"",null,"",{"$nulls":4},"",null,"",null,"No",null,"","","","","","","","",null,null,0,{"$nulls":3},"No"]
[null,442,{"$nulls":5},"",null,"",{"$nulls":4},"",null,"",null,"No",null,"","","","","","","","",null,null,0,{"$nulls":3},"No"]
[null,443,{"$nulls":5},"",null,"",{"$nulls":4},"",null,"",null,"No",null,"","","","","","","","",null,null,0,{"$nulls":3},"No",{"$nulls":6},"","",null,""]
[null,444,{"$nulls":5},"",null,"",{"$nulls":4},"",null,"",null,"No",null,"","","","","","","","",null,null,0,{"$nulls":3},"No"]
[null,445,{"$nulls":5},"",null,"",{"$nulls":4},"",null,"",null,"No",null,"","","","","","","","",null,null,0,{"$nulls":3},"No"]
[null,446,{"$nulls":5},"",null,"",{"$nulls":4},"",null,"",null,"No",null,"","","","","","","","",null,null,0,{"$nulls":3},"No"]
[null,447,{"$nulls":5},"",null,"",{"$nulls":4},"",null,"",null,"No",null,"","","","","","","","",null,null,0,{"$nulls":3},"No"]
[null,448,{"$nulls":5},"",null,"",{"$nulls":4},"",null,"",null,"No",null,"","","","","","","","",null,null,0,{"$nulls":3},"No"]
[null,449,{"$nulls":5},"",null,{"$f":"IF(AND(E468<>\"\",G468<>\"\",$E$8=\"Default Sector Hours\"),VLOOKUP(IF(R468=\"Exterior\",\"Exterior\",$E$7),$V$1036:$W$1041,2,FALSE),\"\")","v":""},{"$nulls":4},{"$f":"IF(L468=\"\",\"\",VLOOKUP(L468,$AO$1113:$AP$1541,2,FALSE))","v":""},null,"",null,"No",null,"",{"$f":"IFERROR(IF(E468=\"\",\"\",G468/1000*IF(OR(I468>0,H468=\"Enter Watts\"),I468,H468)*IF(R468=\"Exterior\",$W$1041*(1-$G$15),IF($E$8=\"Manual Input\",J468,VLOOKUP($E$7,$V$1036:$Y$1040,2,FALSE))*(1-$E$15)      )),\"0\")","v":""},"",{"$f":"IFERROR(IF(AND(L468=\"\", E468=\"\"),\"\",N468/1000*IF(OR(P468>0,O468=\"Enter Watts\"),P468,O468)*IF(R468=\"Exterior\",$W$1041,IF($E$8=\"Manual Input\",Q468,VLOOKUP($E$7,$V$1036:$Y$1040,2,FALSE)))*IF(S468=\"Yes\",IF(R468=\"Exterior\",1-$Y$1041,1-VLOOKUP($E$7,$V$1036:$Y$1040,4,FALSE)),1)),0)","v":""},"","","","",null,null,0,{"$nulls":3},"No",{"$nulls":6},"","",null,""]
[null,450,{"$nulls":5},"",null,"",{"$nulls":4},"",null,"",null,"No",null,{"$f":"IF(R469=\"Interior\",IF(E469=\"\",\"\",IF(OR(I469>0,H469=\"Enter Watts\"),I469*G469/1000*(1-$E$15),H469*G469/1000*(1-$E$15))),IF(E469=\"\",\"\",0))","v":""},"",{"$f":"IF(R469=\"Interior\",IF(AND(L469=\"\", E469=\"\"),\"\",IF(OR(P469>0,O469=\"Enter Watts\", P469=\"\"),P469*N469*(1-$Z$1036)/1000,O469*N469*(1-$Z$1036)/1000)),IF(AND(E469=\"\",L469=\"\"),\"\",0))","v":""},"","",{"$f":"IF(AND(U469=\"\",W469=\"\"),\"\",IF(OR(U469=\"\",W469=\"\"),0,  IF($E$8=\"Manual Input\",$G$9,   VLOOKUP($E$7,$V$1036:$Y$1041,3,FALSE))     *(U469-W469)))","v":""},"","",null,null,{"$f":"AD469*N469","v":0},{"$nulls":3},{"$f":"IF(_xlfn.ISFORMULA(J469)=TRUE,\"No\",\"Yes\")","v":"No"}]
[null,451,{"$nulls":5},"",null,"",{"$nulls":4},"",null,"",null,"No",null,"","","","","","","","",null,null,0,{"$nulls":3},"No"]
[null,452,{"$nulls":5},"",null,"",{"$nulls":4},"",null,"",null,"No",null,"","","","","","","","",null,null,0,{"$nulls":3},"No"]
[null,453,{"$nulls":5},"",null,"",{"$nulls":4},"",null,"",null,"No",null,"","","","","","","","",null,null,0,{"$nulls":3},"No"]
[null,454,{"$nulls":5},"",null,"",{"$nulls":4},"",null,"",null,"No",null,"","","","","","","","",null,null,0,{"$nulls":3},"No"]
[null,455,{"$nulls":5},"",null,"",{"$nulls":4},"",null,"",null,"No",null,"","","","","","","","",null,null,0,{"$nulls":3},"No"]
[null,456,{"$nulls":5},"",null,"",{"$nulls":4},"",null,"",null,"No",null,"","","","",{"$f":"IFERROR(IF(OR(I475>0,H475=\"Enter Watts\"),I475*G475,H475*G475)-IF(OR(P475>0,O475=\"Enter Watts\"),P475*N475,O475*N475),\"\")","v":""},"",{"$f":"IF(AND(V475=\"\",X475=\"\"),\"\",IF(OR(V475=\"\",X475=\"\"),0,V475-X475))","v":""},"",null,null,0,{"$nulls":3},"No"]
[null,457,{"$nulls":5},"",null,"",{"$nulls":4},"",null,"",null,"No",null,"","","","",{"$f":"IFERROR(IF(OR(I476>0,H476=\"Enter Watts\"),I476*G476,H476*G476)-IF(OR(P476>0,O476=\"Enter Watts\"),P476*N476,O476*N476),\"\")","v":""},"",{"$f":"IF(AND(V476=\"\",X476=\"\"),\"\",IF(OR(V476=\"\",X476=\"\"),0,V476-X476))","v":""},"",null,null,0,{"$nulls":3},"No"]
[null,458,{"$nulls":5},"",null,"",{"$nulls":4},"",null,"",null,"No",null,"","","","","","","","",null,null,0,{"$nulls":3},"No"]
[null,459,{"$nulls":5},"",null,"",{"$nulls":4},"",null,"",null,"No",null,"","","","","","","","",null,null,0,{"$nulls":3},"No"]
[null,460,{"$nulls":5},"",null,"",{"$nulls":4},"",null,"",null,"No",null,"","","","","","","","",null,null,0,{"$nulls":3},"No",{"$nulls":6},"","",null,""]
[null,461,{"$nulls":5},"",null,"",{"$nulls":4},"",null,"",null,"No",null,"","","","","","","","",null,null,0,{"$nulls":3},"No"]
[null,462,{"$nulls":5},"",null,"",{"$nulls":4},"",null,"",null,"No",null,"","","","","","","","",null,null,0,{"$nulls":3},"No"]
[null,463,{"$nulls":5},"",null,"",{"$nulls":4},"",null,"",null,"No",null,"","","","","","","","",null,null,0,{"$nulls":3},"No"]
[null,464,{"$nulls":5},"",null,"",{"$nulls":4},"",null,"",null,"No",null,"","","","","","","","",null,null,0,{"$nulls":3},"No"]
[null,465,{"$nulls":5},"",null,"",{"$nulls":4},"",null,"",null,"No",null,"","","","","","","","",null,null,0,{"$nulls":3},"No"]
[null,466,{"$nulls":5},"",null,"",{"$nulls":4},"",null,"",null,"No",null,"","","","","","","","",null,null,0,{"$nulls":3},"No",{"$nulls":6},"","",null,""]
[null,467,{"$nulls":5},"",null,"",{"$nulls":4},"",null,"",null,"No",null,"","","","","","","","",null,null,0,{"$nulls":3},"No"]
[null,468,{"$nulls":5},"",null,"",{"$nulls":4},"",null,"",null,"No",null,"","","","","","","","",null,null,0,{"$nulls":3},"No"]
[null,469,{"$nulls":5},"",null,"",{"$nulls":4},"",null,"",null,"No",null,"","","","","","","","",null,null,0,{"$nulls":3},"No"]
[null,470,{"$nulls":5},"",null,"",{"$nulls":4},"",null,"",null,"No",null,"","","","","","","","",null,null,0,{"$nulls":3},"No"]
[null,471,{"$nulls":5},"",null,"",{"$nulls":4},"",null,"",null,"No",null,"","","","","","","","",null,null,0,{"$nulls":3},"No"]
[null,472,{"$nulls":5},"",null,"",{"$nulls":4},"",null,"",null,"No",null,"","","","","","","","",null,null,0,{"$nulls":3},"No"]
[null,473,{"$nulls":5},"",null,"",{"$nulls":4},"",null,"",null,"No",null,"","","","","","","","",null,null,0,{"$nulls":3},"No",{"$nulls":6},"","",null,""]
[null,474,{"$nulls":5},"",null,"",{"$nulls":4},"",null,"",null,"No",null,"","","","","","","","",null,null,0,{"$nulls":3},"No"]
[null,475,{"$nulls":5},"",null,"",{"$nulls":4},"",null,"",null,"No",null,"","","","","","","","",null,null,0,{"$nulls":3},"No"]
[null,476,{"$nulls":5},"",null,"",{"$nulls":4},"",null,"",null,"No",null,"","","","","","","","",null,null,0,{"$nulls":3},"No"]
[null,477,{"$nulls":5},"",null,"",{"$nulls":4},"",null,"",null,"No",null,"","","","","","","","",null,null,0,{"$nulls":3},"No"]
[null,478,{"$nulls":5},"",null,"",{"$nulls":4},"",null,"",null,"No",null,"","","","","","","","",null,null,0,{"$nulls":3},"No"]
[null,479,{"$nulls":5},"",null,"",{"$nulls":4},"",null,"",null,"No",null,"","","","","","","","",null,null,0,{"$nulls":3},"No",{"$nulls":6},"","",null,""]
[null,480,{"$nulls":5},"",null,"",{"$nulls":4},"",null,"",null,"No",null,"","","","","","","","",null,null,0,{"$nulls":3},"No"]
[null,481,{"$nulls":5},"",null,"",{"$nulls":4},"",null,"",null,"No",null,"","","","","","","","",null,null,0,{"$nulls":3},"No"]
[null,482,{"$nulls":5},"",null,"",{"$nulls":4},"",null,"",null,"No",null,"","","","","","","","",null,null,0,{"$nulls":3},"No"]
[null,483,{"$nulls":5},"",null,"",{"$nulls":4},"",null,"",null,"No",null,"","","","","","","","",null,null,0,{"$nulls":3},"No"]
[null,484,{"$nulls":5},"",null,"",{"$nulls":4},"",null,"",null,"No",null,"","","","","","","","",null,null,0,{"$nulls":3},"No"]
[null,485,{"$nulls":5},"",null,"",{"$nulls":4},"",null,"",null,"No",null,"","","","","","","","",null,null,0,{"$nulls":3},"No"]
[null,486,{"$nulls":5},"",null,"",{"$nulls":4},"",null,"",null,"No",null,"","","","","","","","",null,null,0,{"$nulls":3},"No"]
[null,487,{"$nulls":5},"",null,"",{"$nulls":4},"",null,"",null,"No",null,"","","","","","","","",null,null,0,{"$nulls":3},"No"]
[null,488,{"$nulls":5},"",null,"",{"$nulls":4},"",null,"",null,"No",null,"","","","","","","","",null,null,0,{"$nulls":3},"No"]
[null,489,{"$nulls":5},"",null,"",{"$nulls":4},"",null,"",null,"No",null,"","","","","","","","",null,null,0,{"$nulls":3},"No"]
[null,490,{"$nulls":5},"",null,"",{"$nulls":4},"",null,"",null,"No",null,"","","","","","","","",null,null,0,{"$nulls":3},"No"]
[null,491,{"$nulls":5},"",null,"",{"$nulls":4},"",null,"",null,"No",null,"","","","","","","","",null,null,0,{"$nulls":3},"No",{"$nulls":6},"","",null,""]
[null,492,{"$nulls":5},"",null,"",{"$nulls":4},"",null,"",null,"No",null,"","","","","","","","",null,null,0,{"$nulls":3},"No"]
[null,493,{"$nulls":5},"",null,"",{"$nulls":4},"",null,"",null,"No",null,"","","","","","","","",null,null,0,{"$nulls":3},"No"]
[null,494,{"$nulls":5},{"$f":"IF(E513=\"\",\"\",VLOOKUP(E513,$AO$1114:$AP$1541,2,FALSE))","v":""},null,"",{"$nulls":4},"",null,"",null,"No",null,"","","","","","","",{"$f":"IF(AA513=\"\",\"\",IF(AND(R513=\"Interior\",S513=\"No\",OR(T513=\"\",T513=\"No\")),$J$1027,IF(AND(R513=\"Interior\",S513=\"Yes\"),$J$1028,IF(AND(R513=\"Exterior\",S513=\"Yes\"),$J$1029,IF(AND(R513=\"Exterior\",S513=\"No\",N513<>G513),\"DNQ\",\"See Lighting Catalog to determine Code\")))))","v":""},null,null,0,{"$nulls":3},"No"]
[null,495,{"$nulls":5},"",null,"",{"$nulls":4},"",null,"",null,"No",null,"","","","","","","","",null,null,0,{"$nulls":3},"No"]
[null,496,{"$nulls":5},"",null,"",{"$nulls":4},"",null,"",null,"No",null,"","","","","","","","",null,null,0,{"$nulls":3},"No"]
[null,497,{"$nulls":5},"",null,"",{"$nulls":4},"",null,"",null,"No",null,"","","","","","","","",null,null,0,{"$nulls":3},"No",{"$nulls":6},"","",null,""]
[null,498,{"$nulls":5},"",null,"",{"$nulls":4},"",null,"",null,"No",null,"","","","","","","","",null,null,0,{"$nulls":3},"No"]
[null,499,{"$nulls":5},"",null,"",{"$nulls":4},"",null,"",null,"No",null,"","","","","","","","",null,null,0,{"$nulls":3},"No"]
[null,500,{"$nulls":5},"",null,"",{"$nulls":4},"",null,"",null,"No",null,"","","","","","","","",null,null,0,{"$nulls":3},"No"]
[null,501,{"$nulls":5},"",null,"",{"$nulls":4},"",null,"",null,"No",null,"","","","","","","","",null,null,0,{"$nulls":3},"No"]
[null,502,{"$nulls":5},"",null,"",{"$nulls":4},"",null,"",null,"No",null,"","","","","","","","",null,null,0,{"$nulls":3},"No"]
[null,503,{"$nulls":5},"",null,"",{"$nulls":4},"",null,"",null,"No",null,"","","","","","","","",null,null,0,{"$nulls":3},"No"]
[null,504,{"$nulls":5},"",null,"",{"$nulls":4},"",null,"",null,"No",null,"","","","",{"$f":"IFERROR(IF(OR(I523>0,H523=\"Enter Watts\"),I523*G523,H523*G523)-IF(OR(P523>0,O523=\"Enter Watts\"),P523*N523,O523*N523),\"\")","v":""},"",{"$f":"IF(AND(V523=\"\",X523=\"\"),\"\",IF(OR(V523=\"\",X523=\"\"),0,V523-X523))","v":""},"",null,null,0,{"$nulls":3},"No"]
[null,505,{"$nulls":5},"",null,"",{"$nulls":4},"",null,"",null,"No",null,"","","","",{"$f":"IFERROR(IF(OR(I524>0,H524=\"Enter Watts\"),I524*G524,H524*G524)-IF(OR(P524>0,O524=\"Enter Watts\"),P524*N524,O524*N524),\"\")","v":""},"",{"$f":"IF(AND(V524=\"\",X524=\"\"),\"\",IF(OR(V524=\"\",X524=\"\"),0,V524-X524))","v":""},"",null,null,0,{"$nulls":3},"No"]
[null,506,{"$nulls":5},"",null,"",{"$nulls":4},"",null,"",null,"No",null,"","","","","","","","",null,null,0,{"$nulls":3},"No"]
[null,507,{"$nulls":5},"",null,"",{"$nulls":4},"",null,"",null,"No",null,"","","","","","","","",null,null,0,{"$nulls":3},"No"]
[null,508,{"$nulls":5},"",null,"",{"$nulls":4},"",null,"",null,"No",null,"","","","","","","","",null,null,0,{"$nulls":3},"No",{"$nulls":6},"","",null,""]
[null,509,{"$nulls":5},"",null,"",{"$nulls":4},"",null,"",null,"No",null,"","","","","","","","",null,null,0,{"$nulls":3},"No"]
[null,510,{"$nulls":5},"",null,"",{"$nulls":4},"",null,"",null,"No",null,"","","","","","","","",null,null,0,{"$nulls":3},"No"]
[null,511,{"$nulls":5},"",null,"",{"$nulls":4},"",null,"",null,"No",null,"","","","","","","","",null,null,0,{"$nulls":3},"No"]
[null,512,{"$nulls":5},"",null,"",{"$nulls":4},"",null,"",null,"No",null,"","","","","","","","",null,null,0,{"$nulls":3},"No"]
[null,513,{"$nulls":5},"",null,{"$f":"IF(AND(E532<>\"\",G532<>\"\",$E$8=\"Default Sector Hours\"),VLOOKUP(IF(R532=\"Exterior\",\"Exterior\",$E$7),$V$1036:$W$1041,2,FALSE),\"\")","v":""},{"$nulls":4},{"$f":"IF(L532=\"\",\"\",VLOOKUP(L532,$AO$1113:$AP$1541,2,FALSE))","v":""},null,"",null,"No",null,"",{"$f":"IFERROR(IF(E532=\"\",\"\",G532/1000*IF(OR(I532>0,H532=\"Enter Watts\"),I532,H532)*IF(R532=\"Exterior\",$W$1041*(1-$G$15),IF($E$8=\"Manual Input\",J532,VLOOKUP($E$7,$V$1036:$Y$1040,2,FALSE))*(1-$E$15)      )),\"0\")","v":""},"",{"$f":"IFERROR(IF(AND(L532=\"\", E532=\"\"),\"\",N532/1000*IF(OR(P532>0,O532=\"Enter Watts\"),P532,O532)*IF(R532=\"Exterior\",$W$1041,IF($E$8=\"Manual Input\",Q532,VLOOKUP($E$7,$V$1036:$Y$1040,2,FALSE)))*IF(S532=\"Yes\",IF(R532=\"Exterior\",1-$Y$1041,1-VLOOKUP($E$7,$V$1036:$Y$1040,4,FALSE)),1)),0)","v":""},"","","","",null,null,0,{"$nulls":3},"No"]
[null,514,{"$nulls":5},"",null,"",{"$nulls":4},"",null,"",null,"No",null,{"$f":"IF(R533=\"Interior\",IF(E533=\"\",\"\",IF(OR(I533>0,H533=\"Enter Watts\"),I533*G533/1000*(1-$E$15),H533*G533/1000*(1-$E$15))),IF(E533=\"\",\"\",0))","v":""},"",{"$f":"IF(R533=\"Interior\",IF(AND(L533=\"\", E533=\"\"),\"\",IF(OR(P533>0,O533=\"Enter Watts\", P533=\"\"),P533*N533*(1-$Z$1036)/1000,O533*N533*(1-$Z$1036)/1000)),IF(AND(E533=\"\",L533=\"\"),\"\",0))","v":""},"","",{"$f":"IF(AND(U533=\"\",W533=\"\"),\"\",IF(OR(U533=\"\",W533=\"\"),0,  IF($E$8=\"Manual Input\",$G$9,   VLOOKUP($E$7,$V$1036:$Y$1041,3,FALSE))     *(U533-W533)))","v":""},"","",null,null,{"$f":"AD533*N533","v":0},{"$nulls":3},{"$f":"IF(_xlfn.ISFORMULA(J533)=TRUE,\"No\",\"Yes\")","v":"No"},{"$nulls":6},"","",null,""]
[null,515,{"$nulls":5},"",null,"",{"$nulls":4},"",null,"",null,"No",null,"","","","","","","","",null,null,0,{"$nulls":3},"No"]
[null,516,{"$nulls":5},"",null,"",{"$nulls":4},"",null,"",null,"No",null,"","","","","","","","",null,null,0,{"$nulls":3},"No"]
[null,517,{"$nulls":5},"",null,"",{"$nulls":4},"",null,"",null,"No",null,"","","","","","","","",null,null,0,{"$nulls":3},"No"]
[null,518,{"$nulls":5},"",null,"",{"$nulls":4},"",null,"",null,"No",null,"","","","","","","","",null,null,0,{"$nulls":3},"No"]
[null,519,{"$nulls":5},"",null,"",{"$nulls":4},"",null,"",null,"No",null,"","","","","","","","",null,null,0,{"$nulls":3},"No"]
[null,520,{"$nulls":5},"",null,"",{"$nulls":4},"",null,"",null,"No",null,"","","","","","","","",null,null,0,{"$nulls":3},"No"]
[null,521,{"$nulls":5},"",null,"",{"$nulls":4},"",null,"",null,"No",null,"","","","","","","","",null,null,0,{"$nulls":3},"No",{"$nulls":6},"","",null,""]
[null,522,{"$nulls":5},"",null,"",{"$nulls":4},"",null,"",null,"No",null,"","","","","","","","",null,null,0,{"$nulls":3},"No"]
[null,523,{"$nulls":5},"",null,"",{"$nulls":4},"",null,"",null,"No",null,"","","","","","","","",null,null,0,{"$nulls":3},"No"]
[null,524,{"$nulls":5},"",null,"",{"$nulls":4},"",null,"",null,"No",null,"","","","","","","","",null,null,0,{"$nulls":3},"No"]
[null,525,{"$nulls":5},"",null,"",{"$nulls":4},"",null,"",null,"No",null,"","","","","","","","",null,null,0,{"$nulls":3},"No"]
[null,526,{"$nulls":5},"",null,"",{"$nulls":4},"",null,"",null,"No",null,"","","","","","","","",null,null,0,{"$nulls":3},"No"]
[null,527,{"$nulls":5},"",null,"",{"$nulls":4},"",null,"",null,"No",null,"","","","","","","","",null,null,0,{"$nulls":3},"No",{"$nulls":6},"","",null,""]
[null,528,{"$nulls":5},"",null,"",{"$nulls":4},"",null,"",null,"No",null,"","","","","","","","",null,null,0,{"$nulls":3},"No"]
[null,529,{"$nulls":5},"",null,"",{"$nulls":4},"",null,"",null,"No",null,"","","","","","","","",null,null,0,{"$nulls":3},"No"]
[null,530,{"$nulls":5},"",null,"",{"$nulls":4},"",null,"",null,"No",null,"","","","","","","","",null,null,0,{"$nulls":3},"No"]
[null,531,{"$nulls":5},"",null,"",{"$nulls":4},"",null,"",null,"No",null,"","","","","","","","",null,null,0,{"$nulls":3},"No"]
[null,532,{"$nulls":5},"",null,"",{"$nulls":4},"",null,"",null,"No",null,"","","","","","","","",null,null,0,{"$nulls":3},"No"]
[null,533,{"$nulls":5},"",null,"",{"$nulls":4},"",null,"",null,"No",null,"","","","","","","","",null,null,0,{"$nulls":3},"No"]
[null,534,{"$nulls":5},"",null,"",{"$nulls":4},"",null,"",null,"No",null,"","","","","","","","",null,null,0,{"$nulls":3},"No"]
[null,535,{"$nulls":5},"",null,"",{"$nulls":4},"",null,"",null,"No",null,"","","","","","","","",null,null,0,{"$nulls":3},"No"]
[null,536,{"$nulls":5},"",null,"",{"$nulls":4},"",null,"",null,"No",null,"","","","","","","","",null,null,0,{"$nulls":3},"No"]
[null,537,{"$nulls":5},"",null,"",{"$nulls":4},"",null,"",null,"No",null,"","","","","","","","",null,null,0,{"$nulls":3},"No"]
[null,538,{"$nulls":5},"",null,"",{"$nulls":4},"",null,"",null,"No",null,"","","","","","","","",null,null,0,{"$nulls":3},"No"]
[null,539,{"$nulls":5},"",null,"",{"$nulls":4},"",null,"",null,"No",null,"","","","","","","","",null,null,0,{"$nulls":3},"No",{"$nulls":6},"","",null,""]
[null,540,{"$nulls":5},"",null,"",{"$nulls":4},"",null,"",null,"No",null,"","","","","","","","",null,null,0,{"$nulls":3},"No"]
[null,541,{"$nulls":5},"",null,"",{"$nulls":4},"",null,"",null,"No",null,"","","","","","","","",null,null,0,{"$nulls":3},"No"]
[null,542,{"$nulls":5},"",null,"",{"$nulls":4},"",null,"",null,"No",null,"","","","","","","","",null,null,0,{"$nulls":3},"No"]
[null,543,{"$nulls":5},"",null,"",{"$nulls":4},"",null,"",null,"No",null,"","","","","","","","",null,null,0,{"$nulls":3},"No"]
[null,544,{"$nulls":5},"",null,"",{"$nulls":4},"",null,"",null,"No",null,"","","","","","","","",null,null,0,{"$nulls":3},"No"]
[null,545,{"$nulls":5},"",null,"",{"$nulls":4},"",null,"",null,"No",null,"","","","","","","","",null,null,0,{"$nulls":3},"No",{"$nulls":6},"","",null,""]
[null,546,{"$nulls":5},"",null,"",{"$nulls":4},"",null,"",null,"No",null,"","","","","","","","",null,null,0,{"$nulls":3},"No"]
[null,547,{"$nulls":5},"",null,"",{"$nulls":4},"",null,"",null,"No",null,"","","","","","","","",null,null,0,{"$nulls":3},"No"]
[null,548,{"$nulls":5},"",null,"",{"$nulls":4},"",null,"",null,"No",null,"","","","","","","","",null,null,0,{"$nulls":3},"No"]
[null,549,{"$nulls":5},"",null,"",{"$nulls":4},"",null,"",null,"No",null,"","","","","","","","",null,null,0,{"$nulls":3},"No"]
[null,550,{"$nulls":5},"",null,"",{"$nulls":4},"",null,"",null,"No",null,"","","","","","","","",null,null,0,{"$nulls":3},"No"]
[null,551,{"$nulls":5},"",null,"",{"$nulls":4},"",null,"",null,"No",null,"","","","","","","","",null,null,0,{"$nulls":3},"No"]
[null,552,{"$nulls":5},"",null,"",{"$nulls":4},"",null,"",null,"No",null,"","","","",{"$f":"IFERROR(IF(OR(I571>0,H571=\"Enter Watts\"),I571*G571,H571*G571)-IF(OR(P571>0,O571=\"Enter Watts\"),P571*N571,O571*N571),\"\")","v":""},"",{"$f":"IF(AND(V571=\"\",X571=\"\"),\"\",IF(OR(V571=\"\",X571=\"\"),0,V571-X571))","v":""},"",null,null,0,{"$nulls":3},"No"]
[null,553,{"$nulls":5},"",null,"",{"$nulls":4},"",null,"",null,"No",null,"","","","",{"$f":"IFERROR(IF(OR(I572>0,H572=\"Enter Watts\"),I572*G572,H572*G572)-IF(OR(P572>0,O572=\"Enter Watts\"),P572*N572,O572*N572),\"\")","v":""},"",{"$f":"IF(AND(V572=\"\",X572=\"\"),\"\",IF(OR(V572=\"\",X572=\"\"),0,V572-X572))","v":""},"",null,null,0,{"$nulls":3},"No"]
[null,554,{"$nulls":5},"",null,"",{"$nulls":4},"",null,"",null,"No",null,"","","","","","","","",null,null,0,{"$nulls":3},"No"]
[null,555,{"$nulls":5},"",null,"",{"$nulls":4},"",null,"",null,"No",null,"","","","","","","","",null,null,0,{"$nulls":3},"No"]
[null,556,{"$nulls":5},"",null,"",{"$nulls":4},"",null,"",null,"No",null,"","","","","","","","",null,null,0,{"$nulls":3},"No",{"$nulls":6},"","",null,""]
[null,557,{"$nulls":5},"",null,"",{"$nulls":4},"",null,{"$f":"IF(J576=\"\",\"\",J576)","v":""},null,"No",null,"","","","","","","","",null,null,0,{"$nulls":3},"No"]
[null,558,{"$nulls":5},{"$f":"IF(E577=\"\",\"\",VLOOKUP(E577,$AO$1114:$AP$1541,2,FALSE))","v":""},null,"",{"$nulls":4},"",null,"",null,"No",null,"","","","","","","",{"$f":"IF(AA577=\"\",\"\",IF(AND(R577=\"Interior\",S577=\"No\",OR(T577=\"\",T577=\"No\")),$J$1027,IF(AND(R577=\"Interior\",S577=\"Yes\"),$J$1028,IF(AND(R577=\"Exterior\",S577=\"Yes\"),$J$1029,IF(AND(R577=\"Exterior\",S577=\"No\",N577<>G577),\"DNQ\",\"See Lighting Catalog to determine Code\")))))","v":""},null,null,0,{"$nulls":3},"No"]
[null,559,{"$nulls":5},"",null,"",{"$nulls":4},"",null,"",null,"No",null,"","","","","","","","",null,null,0,{"$nulls":3},"No"]
[null,560,{"$nulls":5},"",null,"",{"$nulls":4},"",null,"",null,"No",null,"","","","","","","","",null,null,0,{"$nulls":3},"No"]
[null,561,{"$nulls":5},"",null,"",{"$nulls":4},"",null,"",null,"No",null,"","","","","","","","",null,null,0,{"$nulls":3},"No"]
[null,562,{"$nulls":5},"",null,"",{"$nulls":4},"",null,"",null,"No",null,"","","","","","","","",null,null,0,{"$nulls":3},"No",{"$nulls":6},"","",null,""]
[null,563,{"$nulls":5},"",null,"",{"$nulls":4},"",null,"",null,"No",null,"","","","","","","","",null,null,0,{"$nulls":3},"No"]
[null,564,{"$nulls":5},"",null,"",{"$nulls":4},"",null,"",null,"No",null,"","","","","","","","",null,null,0,{"$nulls":3},"No"]
[null,565,{"$nulls":5},"",null,"",{"$nulls":4},"",null,"",null,"No",null,"","","","","","","","",null,null,0,{"$nulls":3},"No"]
[null,566,{"$nulls":5},"",null,"",{"$nulls":4},"",null,"",null,"No",null,"","","","","","","","",null,null,0,{"$nulls":3},"No"]
[null,567,{"$nulls":5},"",null,"",{"$nulls":4},"",null,"",null,"No",null,"","","","","","","","",null,null,0,{"$nulls":3},"No"]
[null,568,{"$nulls":5},"",null,"",{"$nulls":4},"",null,"",null,"No",null,"","","","","","","","",null,null,0,{"$nulls":3},"No"]
[null,569,{"$nulls":5},"",null,"",{"$nulls":4},"",null,"",null,"No",null,"","","","","","","","",null,null,0,{"$nulls":3},"No",{"$nulls":6},"","",null,""]
[null,570,{"$nulls":5},"",null,"",{"$nulls":4},"",null,"",null,"No",null,"","","","","","","","",null,null,0,{"$nulls":3},"No"]
[null,571,{"$nulls":5},"",null,"",{"$nulls":4},"",null,"",null,"No",null,"","","","","","","","",null,null,0,{"$nulls":3},"No"]
[null,572,{"$nulls":5},"",null,"",{"$nulls":4},"",null,"",null,"No",null,"","","","","","","","",null,null,0,{"$nulls":3},"No"]
[null,573,{"$nulls":5},"",null,"",{"$nulls":4},"",null,"",null,"No",null,"","","","","","","","",null,null,0,{"$nulls":3},"No"]
[null,574,{"$nulls":5},"",null,"",{"$nulls":4},"",null,"",null,"No",null,"","","","","","","","",null,null,0,{"$nulls":3},"No"]
[null,575,{"$nulls":5},"",null,"",{"$nulls":4},"",null,"",null,"No",null,"","","","","","","","",null,null,0,{"$nulls":3},"No",{"$nulls":6},"","",null,""]
[null,576,{"$nulls":5},"",null,"",{"$nulls":4},"",null,"",null,"No",null,"","","","","","","","",null,null,0,{"$nulls":3},"No"]
[null,577,{"$nulls":5},"",null,{"$f":"IF(AND(E596<>\"\",G596<>\"\",$E$8=\"Default Sector Hours\"),VLOOKUP(IF(R596=\"Exterior\",\"Exterior\",$E$7),$V$1036:$W$1041,2,FALSE),\"\")","v":""},{"$nulls":4},{"$f":"IF(L596=\"\",\"\",VLOOKUP(L596,$AO$1113:$AP$1541,2,FALSE))","v":""},null,"",null,"No",null,"",{"$f":"IFERROR(IF(E596=\"\",\"\",G596/1000*IF(OR(I596>0,H596=\"Enter Watts\"),I596,H596)*IF(R596=\"Exterior\",$W$1041*(1-$G$15),IF($E$8=\"Manual Input\",J596,VLOOKUP($E$7,$V$1036:$Y$1040,2,FALSE))*(1-$E$15)      )),\"0\")","v":""},"",{"$f":"IFERROR(IF(AND(L596=\"\", E596=\"\"),\"\",N596/1000*IF(OR(P596>0,O596=\"Enter Watts\"),P596,O596)*IF(R596=\"Exterior\",$W$1041,IF($E$8=\"Manual Input\",Q596,VLOOKUP($E$7,$V$1036:$Y$1040,2,FALSE)))*IF(S596=\"Yes\",IF(R596=\"Exterior\",1-$Y$1041,1-VLOOKUP($E$7,$V$1036:$Y$1040,4,FALSE)),1)),0)","v":""},"","","","",null,null,0,{"$nulls":3},"No"]
[null,578,{"$nulls":5},"",null,"",{"$nulls":4},"",null,"",null,"No",null,{"$f":"IF(R597=\"Interior\",IF(E597=\"\",\"\",IF(OR(I597>0,H597=\"Enter Watts\"),I597*G597/1000*(1-$E$15),H597*G597/1000*(1-$E$15))),IF(E597=\"\",\"\",0))","v":""},"",{"$f":"IF(R597=\"Interior\",IF(AND(L597=\"\", E597=\"\"),\"\",IF(OR(P597>0,O597=\"Enter Watts\", P597=\"\"),P597*N597*(1-$Z$1036)/1000,O597*N597*(1-$Z$1036)/1000)),IF(AND(E597=\"\",L597=\"\"),\"\",0))","v":""},"","",{"$f":"IF(AND(U597=\"\",W597=\"\"),\"\",IF(OR(U597=\"\",W597=\"\"),0,  IF($E$8=\"Manual Input\",$G$9,   VLOOKUP($E$7,$V$1036:$Y$1041,3,FALSE))     *(U597-W597)))","v":""},"","",null,null,{"$f":"AD597*N597","v":0},{"$nulls":3},{"$f":"IF(_xlfn.ISFORMULA(J597)=TRUE,\"No\",\"Yes\")","v":"No"}]
[null,579,{"$nulls":5},"",null,"",{"$nulls":4},"",null,"",null,"No",null,"","","","","","","","",null,null,0,{"$nulls":3},"No"]
[null,580,{"$nulls":5},"",null,"",{"$nulls":4},"",null,"",null,"No",null,"","","","","","","","",null,null,0,{"$nulls":3},"No"]
[null,581,{"$nulls":5},"",null,"",{"$nulls":4},"",null,"",null,"No",null,"","","","","","","","",null,null,0,{"$nulls":3},"No"]
[null,582,{"$nulls":5},"",null,"",{"$nulls":4},"",null,"",null,"No",null,"","","","","","","","",null,null,0,{"$nulls":3},"No"]
[null,583,{"$nulls":5},"",null,"",{"$nulls":4},"",null,"",null,"No",null,"","","","","","","","",null,null,0,{"$nulls":3},"No"]
[null,584,{"$nulls":5},"",null,"",{"$nulls":4},"",null,"",null,"No",null,"","","","","","","","",null,null,0,{"$nulls":3},"No"]
[null,585,{"$nulls":5},"",null,"",{"$nulls":4},"",null,"",null,"No",null,"","","","","","","","",null,null,0,{"$nulls":3},"No"]
[null,586,{"$nulls":5},"",null,"",{"$nulls":4},"",null,"",null,"No",null,"","","","","","","","",null,null,0,{"$nulls":3},"No"]
[null,587,{"$nulls":5},"",null,"",{"$nulls":4},"",null,"",null,"No",null,"","","","","","","","",null,null,0,{"$nulls":3},"No",{"$nulls":6},"","",null,""]
[null,588,{"$nulls":5},"",null,"",{"$nulls":4},"",null,"",null,"No",null,"","","","","","","","",null,null,0,{"$nulls":3},"No"]
[null,589,{"$nulls":5},"",null,"",{"$nulls":4},"",null,"",null,"No",null,"","","","","","","","",null,null,0,{"$nulls":3},"No"]
[null,590,{"$nulls":5},"",null,"",{"$nulls":4},"",null,"",null,"No",null,"","","","","","","","",null,null,0,{"$nulls":3},"No"]
[null,591,{"$nulls":5},"",null,"",{"$nulls":4},"",null,"",null,"No",null,"","","","","","","","",null,null,0,{"$nulls":3},"No"]
[null,592,{"$nulls":5},"",null,"",{"$nulls":4},"",null,"",null,"No",null,"","","","","","","","",null,null,0,{"$nulls":3},"No"]
[null,593,{"$nulls":5},"",null,"",{"$nulls":4},"",null,"",null,"No",null,"","","","","","","","",null,null,0,{"$nulls":3},"No",{"$nulls":6},"","",null,""]
[null,594,{"$nulls":5},"",null,"",{"$nulls":4},"",null,"",null,"No",null,"","","","","","","","",null,null,0,{"$nulls":3},"No"]
[null,595,{"$nulls":5},"",null,"",{"$nulls":4},"",null,"",null,"No",null,"","","","","","","","",null,null,0,{"$nulls":3},"No"]
[null,596,{"$nulls":5},"",null,"",{"$nulls":4},"",null,"",null,"No",null,"","","","","","","","",null,null,0,{"$nulls":3},"No"]
[null,597,{"$nulls":5},"",null,"",{"$nulls":4},"",null,"",null,"No",null,"","","","","","","","",null,null,0,{"$nulls":3},"No"]
[null,598,{"$nulls":5},"",null,"",{"$nulls":4},"",null,"",null,"No",null,"","","","","","","","",null,null,0,{"$nulls":3},"No"]
[null,599,{"$nulls":5},"",null,"",{"$nulls":4},"",null,"",null,"No",null,"","","","","","","","",null,null,0,{"$nulls":3},"No"]
[null,600,{"$nulls":5},"",null,"",{"$nulls":4},"",null,"",null,"No",null,"","","","",{"$f":"IFERROR(IF(OR(I619>0,H619=\"Enter Watts\"),I619*G619,H619*G619)-IF(OR(P619>0,O619=\"Enter Watts\"),P619*N619,O619*N619),\"\")","v":""},"",{"$f":"IF(AND(V619=\"\",X619=\"\"),\"\",IF(OR(V619=\"\",X619=\"\"),0,V619-X619))","v":""},"",null,null,0,{"$nulls":3},"No"]
[null,601,{"$nulls":5},"",null,"",{"$nulls":4},"",null,"",null,"No",null,"","","","",{"$f":"IFERROR(IF(OR(I620>0,H620=\"Enter Watts\"),I620*G620,H620*G620)-IF(OR(P620>0,O620=\"Enter Watts\"),P620*N620,O620*N620),\"\")","v":""},"",{"$f":"IF(AND(V620=\"\",X620=\"\"),\"\",IF(OR(V620=\"\",X620=\"\"),0,V620-X620))","v":""},"",null,null,0,{"$nulls":3},"No"]
[null,602,{"$nulls":5},"",null,"",{"$nulls":4},"",null,"",null,"No",null,"","","","","","","","",null,null,0,{"$nulls":3},"No"]
[null,603,{"$nulls":5},"",null,"",{"$nulls":4},"",null,"",null,"No",null,"","","","","","","","",null,null,0,{"$nulls":3},"No"]
[null,604,{"$nulls":5},"",null,"",{"$nulls":4},"",null,"",null,"No",null,"","","","","","","","",null,null,0,{"$nulls":3},"No",{"$nulls":6},"","",null,""]
[null,605,{"$nulls":5},"",null,"",{"$nulls":4},"",null,"",null,"No",null,"","","","","","","","",null,null,0,{"$nulls":3},"No"]
[null,606,{"$nulls":5},"",null,"",{"$nulls":4},"",null,"",null,"No",null,"","","","","","","","",null,null,0,{"$nulls":3},"No"]
[null,607,{"$nulls":5},"",null,"",{"$nulls":4},"",null,"",null,"No",null,"","","","","","","","",null,null,0,{"$nulls":3},"No"]
[null,608,{"$nulls":5},"",null,"",{"$nulls":4},"",null,"",null,"No",null,"","","","","","","","",null,null,0,{"$nulls":3},"No"]
[null,609,{"$nulls":5},"",null,"",{"$nulls":4},"",null,"",null,"No",null,"","","","","","","","",null,null,0,{"$nulls":3},"No"]
[null,610,{"$nulls":5},"",null,"",{"$nulls":4},"",null,"",null,"No",null,"","","","","","","","",null,null,0,{"$nulls":3},"No",{"$nulls":6},"","",null,""]
[null,611,{"$nulls":5},"",null,"",{"$nulls":4},"",null,"",null,"No",null,"","","","","","","","",null,null,0,{"$nulls":3},"No"]
[null,612,{"$nulls":5},"",null,"",{"$nulls":4},"",null,"",null,"No",null,"","","","","","","","",null,null,0,{"$nulls":3},"No"]
[null,613,{"$nulls":5},"",null,"",{"$nulls":4},"",null,"",null,"No",null,"","","","","","","","",null,null,0,{"$nulls":3},"No"]
[null,614,{"$nulls":5},"",null,"",{"$nulls":4},"",null,"",null,"No",null,"","","","","","","","",null,null,0,{"$nulls":3},"No"]
[null,615,{"$nulls":5},"",null,"",{"$nulls":4},"",null,"",null,"No",null,"","","","","","","","",null,null,0,{"$nulls":3},"No"]
[null,616,{"$nulls":5},"",null,"",{"$nulls":4},"",null,"",null,"No",null,"","","","","","","","",null,null,0,{"$nulls":3},"No"]
[null,617,{"$nulls":5},"",null,"",{"$nulls":4},"",null,"",null,"No",null,"","","","","","","","",null,null,0,{"$nulls":3},"No",{"$nulls":6},"","",null,""]
[null,618,{"$nulls":5},"",null,"",{"$nulls":4},"",null,"",null,"No",null,"","","","","","","","",null,null,0,{"$nulls":3},"No"]
[null,619,{"$nulls":5},"",null,"",{"$nulls":4},"",null,"",null,"No",null,"","","","","","","","",null,null,0,{"$nulls":3},"No"]
[null,620,{"$nulls":5},"",null,"",{"$nulls":4},"",null,"",null,"No",null,"","","","","","","","",null,null,0,{"$nulls":3},"No"]
[null,621,{"$nulls":5},"",null,"",{"$nulls":4},"",null,"",null,"No",null,"","","","","","","","",null,null,0,{"$nulls":3},"No"]
[null,622,{"$nulls":5},{"$f":"IF(E641=\"\",\"\",VLOOKUP(E641,$AO$1114:$AP$1541,2,FALSE))","v":""},null,"",{"$nulls":4},"",null,"",null,"No",null,"","","","","","","",{"$f":"IF(AA641=\"\",\"\",IF(AND(R641=\"Interior\",S641=\"No\",OR(T641=\"\",T641=\"No\")),$J$1027,IF(AND(R641=\"Interior\",S641=\"Yes\"),$J$1028,IF(AND(R641=\"Exterior\",S641=\"Yes\"),$J$1029,IF(AND(R641=\"Exterior\",S641=\"No\",N641<>G641),\"DNQ\",\"See Lighting Catalog to determine Code\")))))","v":""},null,null,0,{"$nulls":3},"No"]
[null,623,{"$nulls":5},"",null,"",{"$nulls":4},"",null,"",null,"No",null,"","","","","","","","",null,null,0,{"$nulls":3},"No",{"$nulls":6},"","",null,""]
[null,624,{"$nulls":5},"",null,"",{"$nulls":4},"",null,"",null,"No",null,"","","","","","","","",null,null,0,{"$nulls":3},"No"]
[null,625,{"$nulls":5},"",null,"",{"$nulls":4},"",null,"",null,"No",null,"","","","","","","","",null,null,0,{"$nulls":3},"No"]
[null,626,{"$nulls":5},"",null,"",{"$nulls":4},"",null,"",null,"No",null,"","","","","","","","",null,null,0,{"$nulls":3},"No"]
[null,627,{"$nulls":5},"",null,"",{"$nulls":4},"",null,"",null,"No",null,"","","","","","","","",null,null,0,{"$nulls":3},"No"]
[null,628,{"$nulls":5},"",null,"",{"$nulls":4},"",null,"",null,"No",null,"","","","","","","","",null,null,0,{"$nulls":3},"No"]
[null,629,{"$nulls":5},"",null,"",{"$nulls":4},"",null,"",null,"No",null,"","","","","","","","",null,null,0,{"$nulls":3},"No"]
[null,630,{"$nulls":5},"",null,"",{"$nulls":4},"",null,"",null,"No",null,"","","","","","","","",null,null,0,{"$nulls":3},"No"]
[null,631,{"$nulls":5},"",null,"",{"$nulls":4},"",null,"",null,"No",null,"","","","","","","","",null,null,0,{"$nulls":3},"No"]
[null,632,{"$nulls":5},"",null,"",{"$nulls":4},"",null,"",null,"No",null,"","","","","","","","",null,null,0,{"$nulls":3},"No"]
[null,633,{"$nulls":5},"",null,"",{"$nulls":4},"",null,"",null,"No",null,"","","","","","","","",null,null,0,{"$nulls":3},"No"]
[null,634,{"$nulls":5},"",null,"",{"$nulls":4},"",null,"",null,"No",null,"","","","","","","","",null,null,0,{"$nulls":3},"No"]
[null,635,{"$nulls":5},"",null,"",{"$nulls":4},"",null,"",null,"No",null,"","","","","","","","",null,null,0,{"$nulls":3},"No",{"$nulls":6},"","",null,""]
[null,636,{"$nulls":5},"",null,"",{"$nulls":4},"",null,"",null,"No",null,"","","","","","","","",null,null,0,{"$nulls":3},"No"]
[null,637,{"$nulls":5},"",null,"",{"$nulls":4},"",null,"",null,"No",null,"","","","","","","","",null,null,0,{"$nulls":3},"No"]
[null,638,{"$nulls":5},"",null,"",{"$nulls":4},"",null,"",null,"No",null,"","","","","","","","",null,null,0,{"$nulls":3},"No"]
[null,639,{"$nulls":5},"",null,"",{"$nulls":4},"",null,"",null,"No",null,"","","","","","","","",null,null,0,{"$nulls":3},"No"]
[null,640,{"$nulls":5},"",null,"",{"$nulls":4},"",null,"",null,"No",null,"","","","","","","","",null,null,0,{"$nulls":3},"No"]
[null,641,{"$nulls":5},"",null,{"$f":"IF(AND(E660<>\"\",G660<>\"\",$E$8=\"Default Sector Hours\"),VLOOKUP(IF(R660=\"Exterior\",\"Exterior\",$E$7),$V$1036:$W$1041,2,FALSE),\"\")","v":""},{"$nulls":4},{"$f":"IF(L660=\"\",\"\",VLOOKUP(L660,$AO$1113:$AP$1541,2,FALSE))","v":""},null,"",null,"No",null,"",{"$f":"IFERROR(IF(E660=\"\",\"\",G660/1000*IF(OR(I660>0,H660=\"Enter Watts\"),I660,H660)*IF(R660=\"Exterior\",$W$1041*(1-$G$15),IF($E$8=\"Manual Input\",J660,VLOOKUP($E$7,$V$1036:$Y$1040,2,FALSE))*(1-$E$15)      )),\"0\")","v":""},"",{"$f":"IFERROR(IF(AND(L660=\"\", E660=\"\"),\"\",N660/1000*IF(OR(P660>0,O660=\"Enter Watts\"),P660,O660)*IF(R660=\"Exterior\",$W$1041,IF($E$8=\"Manual Input\",Q660,VLOOKUP($E$7,$V$1036:$Y$1040,2,FALSE)))*IF(S660=\"Yes\",IF(R660=\"Exterior\",1-$Y$1041,1-VLOOKUP($E$7,$V$1036:$Y$1040,4,FALSE)),1)),0)","v":""},"","","","",null,null,0,{"$nulls":3},"No",{"$nulls":6},"","",null,""]
[null,642,{"$nulls":5},"",null,"",{"$nulls":4},"",null,"",null,"No",null,{"$f":"IF(R661=\"Interior\",IF(E661=\"\",\"\",IF(OR(I661>0,H661=\"Enter Watts\"),I661*G661/1000*(1-$E$15),H661*G661/1000*(1-$E$15))),IF(E661=\"\",\"\",0))","v":""},"",{"$f":"IF(R661=\"Interior\",IF(AND(L661=\"\", E661=\"\"),\"\",IF(OR(P661>0,O661=\"Enter Watts\", P661=\"\"),P661*N661*(1-$Z$1036)/1000,O661*N661*(1-$Z$1036)/1000)),IF(AND(E661=\"\",L661=\"\"),\"\",0))","v":""},"","",{"$f":"IF(AND(U661=\"\",W661=\"\"),\"\",IF(OR(U661=\"\",W661=\"\"),0,  IF($E$8=\"Manual Input\",$G$9,   VLOOKUP($E$7,$V$1036:$Y$1041,3,FALSE))     *(U661-W661)))","v":""},"","",null,null,{"$f":"AD661*N661","v":0},{"$nulls":3},{"$f":"IF(_xlfn.ISFORMULA(J661)=TRUE,\"No\",\"Yes\")","v":"No"}]
[null,643,{"$nulls":5},"",null,"",{"$nulls":4},"",null,"",null,"No",null,"","","","","","","","",null,null,0,{"$nulls":3},"No"]
[null,644,{"$nulls":5},"",null,"",{"$nulls":4},"",null,"",null,"No",null,"","","","","","","","",null,null,0,{"$nulls":3},"No"]
[null,645,{"$nulls":5},"",null,"",{"$nulls":4},"",null,"",null,"No",null,"","","","","","","","",null,null,0,{"$nulls":3},"No"]
[null,646,{"$nulls":5},"",null,"",{"$nulls":4},"",null,"",null,"No",null,"","","","","","","","",null,null,0,{"$nulls":3},"No"]
[null,647,{"$nulls":5},"",null,"",{"$nulls":4},"",null,"",null,"No",null,"","","","","","","","",null,null,0,{"$nulls":3},"No"]
[null,648,{"$nulls":5},"",null,"",{"$nulls":4},"",null,"",null,"No",null,"","","","",{"$f":"IFERROR(IF(OR(I667>0,H667=\"Enter Watts\"),I667*G667,H667*G667)-IF(OR(P667>0,O667=\"Enter Watts\"),P667*N667,O667*N667),\"\")","v":""},"",{"$f":"IF(AND(V667=\"\",X667=\"\"),\"\",IF(OR(V667=\"\",X667=\"\"),0,V667-X667))","v":""},"",null,null,0,{"$nulls":3},"No"]
[null,649,{"$nulls":5},"",null,"",{"$nulls":4},"",null,"",null,"No",null,"","","","",{"$f":"IFERROR(IF(OR(I668>0,H668=\"Enter Watts\"),I668*G668,H668*G668)-IF(OR(P668>0,O668=\"Enter Watts\"),P668*N668,O668*N668),\"\")","v":""},"",{"$f":"IF(AND(V668=\"\",X668=\"\"),\"\",IF(OR(V668=\"\",X668=\"\"),0,V668-X668))","v":""},"",null,null,0,{"$nulls":3},"No"]
[null,650,{"$nulls":5},"",null,"",{"$nulls":4},"",null,"",null,"No",null,"","","","","","","","",null,null,0,{"$nulls":3},"No"]
[null,651,{"$nulls":5},"",null,"",{"$nulls":4},"",null,"",null,"No",null,"","","","","","","","",null,null,0,{"$nulls":3},"No"]
[null,652,{"$nulls":5},"",null,"",{"$nulls":4},"",null,"",null,"No",null,"","","","","","","","",null,null,0,{"$nulls":3},"No",{"$nulls":6},"","",null,""]
[null,653,{"$nulls":5},"",null,"",{"$nulls":4},"",null,"",null,"No",null,"","","","","","","","",null,null,0,{"$nulls":3},"No"]
[null,654,{"$nulls":5},"",null,"",{"$nulls":4},"",null,"",null,"No",null,"","","","","","","","",null,null,0,{"$nulls":3},"No"]
[null,655,{"$nulls":5},"",null,"",{"$nulls":4},"",null,"",null,"No",null,"","","","","","","","",null,null,0,{"$nulls":3},"No"]
[null,656,{"$nulls":5},"",null,"",{"$nulls":4},"",null,"",null,"No",null,"","","","","","","","",null,null,0,{"$nulls":3},"No"]
[null,657,{"$nulls":5},"",null,"",{"$nulls":4},"",null,"",null,"No",null,"","","","","","","","",null,null,0,{"$nulls":3},"No"]
[null,658,{"$nulls":5},"",null,"",{"$nulls":4},"",null,"",null,"No",null,"","","","","","","","",null,null,0,{"$nulls":3},"No",{"$nulls":6},"","",null,""]
[null,659,{"$nulls":5},"",null,"",{"$nulls":4},"",null,"",null,"No",null,"","","","","","","","",null,null,0,{"$nulls":3},"No"]
[null,660,{"$nulls":5},"",null,"",{"$nulls":4},"",null,"",null,"No",null,"","","","","","","","",null,null,0,{"$nulls":3},"No"]
[null,661,{"$nulls":5},"",null,"",{"$nulls":4},"",null,"",null,"No",null,"","","","","","","","",null,null,0,{"$nulls":3},"No"]
[null,662,{"$nulls":5},"",null,"",{"$nulls":4},"",null,"",null,"No",null,"","","","","","","","",null,null,0,{"$nulls":3},"No"]
[null,663,{"$nulls":5},"",null,"",{"$nulls":4},"",null,"",null,"No",null,"","","","","","","","",null,null,0,{"$nulls":3},"No"]
[null,664,{"$nulls":5},"",null,"",{"$nulls":4},"",null,"",null,"No",null,"","","","","","","","",null,null,0,{"$nulls":3},"No"]
[null,665,{"$nulls":5},"",null,"",{"$nulls":4},"",null,"",null,"No",null,"","","","","","","","",null,null,0,{"$nulls":3},"No",{"$nulls":6},"","",null,""]
[null,666,{"$nulls":5},"",null,"",{"$nulls":4},"",null,"",null,"No",null,"","","","","","","","",null,null,0,{"$nulls":3},"No"]
[null,667,{"$nulls":5},"",null,"",{"$nulls":4},"",null,"",null,"No",null,"","","","","","","","",null,null,0,{"$nulls":3},"No"]
[null,668,{"$nulls":5},"",null,"",{"$nulls":4},"",null,"",null,"No",null,"","","","","","","","",null,null,0,{"$nulls":3},"No"]
[null,669,{"$nulls":5},"",null,"",{"$nulls":4},"",null,"",null,"No",null,"","","","","","","","",null,null,0,{"$nulls":3},"No"]
[null,670,{"$nulls":5},"",null,"",{"$nulls":4},"",null,"",null,"No",null,"","","","","","","","",null,null,0,{"$nulls":3},"No"]
[null,671,{"$nulls":5},"",null,"",{"$nulls":4},"",null,"",null,"No",null,"","","","","","","","",null,null,0,{"$nulls":3},"No",{"$nulls":6},"","",null,""]
[null,672,{"$nulls":5},"",null,"",{"$nulls":4},"",null,"",null,"No",null,"","","","","","","","",null,null,0,{"$nulls":3},"No"]
[null,673,{"$nulls":5},"",null,"",{"$nulls":4},"",null,"",null,"No",null,"","","","","","","","",null,null,0,{"$nulls":3},"No"]
[null,674,{"$nulls":5},"",null,"",{"$nulls":4},"",null,"",null,"No",null,"","","","","","","","",null,null,0,{"$nulls":3},"No"]
[null,675,{"$nulls":5},"",null,"",{"$nulls":4},"",null,"",null,"No",null,"","","","","","","","",null,null,0,{"$nulls":3},"No"]
[null,676,{"$nulls":5},"",null,"",{"$nulls":4},"",null,"",null,"No",null,"","","","","","","","",null,null,0,{"$nulls":3},"No"]
[null,677,{"$nulls":5},"",null,"",{"$nulls":4},"",null,"",null,"No",null,"","","","","","","","",null,null,0,{"$nulls":3},"No"]
[null,678,{"$nulls":5},"",null,"",{"$nulls":4},"",null,"",null,"No",null,"","","","","","","","",null,null,0,{"$nulls":3},"No"]
[null,679,{"$nulls":5},"",null,"",{"$nulls":4},"",null,"",null,"No",null,"","","","","","","","",null,null,0,{"$nulls":3},"No"]
[null,680,{"$nulls":5},"",null,"",{"$nulls":4},"",null,"",null,"No",null,"","","","","","","","",null,null,0,{"$nulls":3},"No"]
[null,681,{"$nulls":5},"",null,"",{"$nulls":4},"",null,"",null,"No",null,"","","","","","","","",null,null,0,{"$nulls":3},"No"]
[null,682,{"$nulls":5},"",null,"",{"$nulls":4},"",null,"",null,"No",null,"","","","","","","","",null,null,0,{"$nulls":3},"No"]
[null,683,{"$nulls":5},"",null,"",{"$nulls":4},"",null,"",null,"No",null,"","","","","","","","",null,null,0,{"$nulls":3},"No",{"$nulls":6},"","",null,""]
[null,684,{"$nulls":5},"",null,"",{"$nulls":4},"",null,"",null,"No",null,"","","","","","","","",null,null,0,{"$nulls":3},"No"]
[null,685,{"$nulls":5},"",null,"",{"$nulls":4},"",null,"",null,"No",null,"","","","","","","","",null,null,0,{"$nulls":3},"No"]
[null,686,{"$nulls":5},{"$f":"IF(E705=\"\",\"\",VLOOKUP(E705,$AO$1114:$AP$1541,2,FALSE))","v":""},null,"",{"$nulls":4},"",null,"",null,"No",null,"","","","","","","",{"$f":"IF(AA705=\"\",\"\",IF(AND(R705=\"Interior\",S705=\"No\",OR(T705=\"\",T705=\"No\")),$J$1027,IF(AND(R705=\"Interior\",S705=\"Yes\"),$J$1028,IF(AND(R705=\"Exterior\",S705=\"Yes\"),$J$1029,IF(AND(R705=\"Exterior\",S705=\"No\",N705<>G705),\"DNQ\",\"See Lighting Catalog to determine Code\")))))","v":""},null,null,0,{"$nulls":3},"No"]
[null,687,{"$nulls":5},"",null,"",{"$nulls":4},"",null,"",null,"No",null,"","","","","","","","",null,null,0,{"$nulls":3},"No"]
[null,688,{"$nulls":5},"",null,"",{"$nulls":4},"",null,"",null,"No",null,"","","","","","","","",null,null,0,{"$nulls":3},"No"]
[null,689,{"$nulls":5},"",null,"",{"$nulls":4},"",null,"",null,"No",null,"","","","","","","","",null,null,0,{"$nulls":3},"No",{"$nulls":6},"","",null,""]
[null,690,{"$nulls":5},"",null,"",{"$nulls":4},"",null,"",null,"No",null,"","","","","","","","",null,null,0,{"$nulls":3},"No"]
[null,691,{"$nulls":5},"",null,"",{"$nulls":4},"",null,"",null,"No",null,"","","","","","","","",null,null,0,{"$nulls":3},"No"]
[null,692,{"$nulls":5},"",null,"",{"$nulls":4},"",null,"",null,"No",null,"","","","","","","","",null,null,0,{"$nulls":3},"No"]
[null,693,{"$nulls":5},"",null,"",{"$nulls":4},"",null,"",null,"No",null,"","","","","","","","",null,null,0,{"$nulls":3},"No"]
[null,694,{"$nulls":5},"",null,"",{"$nulls":4},"",null,"",null,"No",null,"","","","","","","","",null,null,0,{"$nulls":3},"No"]
[null,695,{"$nulls":5},"",null,"",{"$nulls":4},"",null,"",null,"No",null,"","","","","","","","",null,null,0,{"$nulls":3},"No"]
[null,696,{"$nulls":5},"",null,"",{"$nulls":4},"",null,"",null,"No",null,"","","","",{"$f":"IFERROR(IF(OR(I715>0,H715=\"Enter Watts\"),I715*G715,H715*G715)-IF(OR(P715>0,O715=\"Enter Watts\"),P715*N715,O715*N715),\"\")","v":""},"",{"$f":"IF(AND(V715=\"\",X715=\"\"),\"\",IF(OR(V715=\"\",X715=\"\"),0,V715-X715))","v":""},"",null,null,0,{"$nulls":3},"No"]
[null,697,{"$nulls":5},"",null,"",{"$nulls":4},"",null,"",null,"No",null,"","","","",{"$f":"IFERROR(IF(OR(I716>0,H716=\"Enter Watts\"),I716*G716,H716*G716)-IF(OR(P716>0,O716=\"Enter Watts\"),P716*N716,O716*N716),\"\")","v":""},"",{"$f":"IF(AND(V716=\"\",X716=\"\"),\"\",IF(OR(V716=\"\",X716=\"\"),0,V716-X716))","v":""},"",null,null,0,{"$nulls":3},"No"]
[null,698,{"$nulls":5},"",null,"",{"$nulls":4},"",null,"",null,"No",null,"","","","","","","","",null,null,0,{"$nulls":3},"No"]
[null,699,{"$nulls":5},"",null,"",{"$nulls":4},"",null,"",null,"No",null,"","","","","","","","",null,null,0,{"$nulls":3},"No"]
[null,700,{"$nulls":5},"",null,"",{"$nulls":4},"",null,"",null,"No",null,"","","","","","","","",null,null,0,{"$nulls":3},"No",{"$nulls":6},"","",null,""]
[null,701,{"$nulls":5},"",null,"",{"$nulls":4},"",null,"",null,"No",null,"","","","","","","","",null,null,0,{"$nulls":3},"No"]
[null,702,{"$nulls":5},"",null,"",{"$nulls":4},"",null,"",null,"No",null,"","","","","","","","",null,null,0,{"$nulls":3},"No"]
[null,703,{"$nulls":5},"",null,"",{"$nulls":4},"",null,"",null,"No",null,"","","","","","","","",null,null,0,{"$nulls":3},"No"]
[null,704,{"$nulls":5},"",null,"",{"$nulls":4},"",null,"",null,"No",null,"","","","","","","","",null,null,0,{"$nulls":3},"No"]
[null,705,{"$nulls":5},"",null,{"$f":"IF(AND(E724<>\"\",G724<>\"\",$E$8=\"Default Sector Hours\"),VLOOKUP(IF(R724=\"Exterior\",\"Exterior\",$E$7),$V$1036:$W$1041,2,FALSE),\"\")","v":""},{"$nulls":4},{"$f":"IF(L724=\"\",\"\",VLOOKUP(L724,$AO$1113:$AP$1541,2,FALSE))","v":""},null,"",null,"No",null,"",{"$f":"IFERROR(IF(E724=\"\",\"\",G724/1000*IF(OR(I724>0,H724=\"Enter Watts\"),I724,H724)*IF(R724=\"Exterior\",$W$1041*(1-$G$15),IF($E$8=\"Manual Input\",J724,VLOOKUP($E$7,$V$1036:$Y$1040,2,FALSE))*(1-$E$15)      )),\"0\")","v":""},"",{"$f":"IFERROR(IF(AND(L724=\"\", E724=\"\"),\"\",N724/1000*IF(OR(P724>0,O724=\"Enter Watts\"),P724,O724)*IF(R724=\"Exterior\",$W$1041,IF($E$8=\"Manual Input\",Q724,VLOOKUP($E$7,$V$1036:$Y$1040,2,FALSE)))*IF(S724=\"Yes\",IF(R724=\"Exterior\",1-$Y$1041,1-VLOOKUP($E$7,$V$1036:$Y$1040,4,FALSE)),1)),0)","v":""},"","","","",null,null,0,{"$nulls":3},"No"]
[null,706,{"$nulls":5},"",null,"",{"$nulls":4},"",null,{"$f":"IF(J725=\"\",\"\",J725)","v":""},null,"No",null,{"$f":"IF(R725=\"Interior\",IF(E725=\"\",\"\",IF(OR(I725>0,H725=\"Enter Watts\"),I725*G725/1000*(1-$E$15),H725*G725/1000*(1-$E$15))),IF(E725=\"\",\"\",0))","v":""},"",{"$f":"IF(R725=\"Interior\",IF(AND(L725=\"\", E725=\"\"),\"\",IF(OR(P725>0,O725=\"Enter Watts\", P725=\"\"),P725*N725*(1-$Z$1036)/1000,O725*N725*(1-$Z$1036)/1000)),IF(AND(E725=\"\",L725=\"\"),\"\",0))","v":""},"",{"$f":"IFERROR(IF(OR(I725>0,H725=\"Enter Watts\"),I725*G725,H725*G725)-IF(OR(P725>0,O725=\"Enter Watts\"),P725*N725,O725*N725),\"\")","v":""},{"$f":"IF(AND(U725=\"\",W725=\"\"),\"\",IF(OR(U725=\"\",W725=\"\"),0,  IF($E$8=\"Manual Input\",$G$9,   VLOOKUP($E$7,$V$1036:$Y$1041,3,FALSE))     *(U725-W725)))","v":""},{"$f":"IF(AND(V725=\"\",X725=\"\"),\"\",IF(OR(V725=\"\",X725=\"\"),0,V725-X725))","v":""},"",null,null,{"$f":"AD725*N725","v":0},{"$nulls":3},{"$f":"IF(_xlfn.ISFORMULA(J725)=TRUE,\"No\",\"Yes\")","v":"No"}]
[null,707,{"$nulls":5},"",null,"",{"$nulls":4},"",null,"",null,"No",null,"","","","",{"$f":"IFERROR(IF(OR(I726>0,H726=\"Enter Watts\"),I726*G726,H726*G726)-IF(OR(P726>0,O726=\"Enter Watts\"),P726*N726,O726*N726),\"\")","v":""},"",{"$f":"IF(AND(V726=\"\",X726=\"\"),\"\",IF(OR(V726=\"\",X726=\"\"),0,V726-X726))","v":""},"",null,null,0,{"$nulls":3},"No"]
[null,708,{"$nulls":5},"",null,"",{"$nulls":4},"",null,"",null,"No",null,"","","","","","","","",null,null,0,{"$nulls":3},"No"]
[null,709,{"$nulls":5},"",null,"",{"$nulls":4},"",null,"",null,"No",null,"","","","","","","","",null,null,0,{"$nulls":3},"No"]
[null,710,{"$nulls":5},"",null,"",{"$nulls":4},"",null,"",null,"No",null,"","","","","","","","",null,null,0,{"$nulls":3},"No",{"$nulls":6},"","",null,""]
[null,711,{"$nulls":5},"",null,"",{"$nulls":4},"",null,"",null,"No",null,"","","","","","","","",null,null,0,{"$nulls":3},"No"]
[null,712,{"$nulls":5},"",null,"",{"$nulls":4},"",null,"",null,"No",null,"","","","","","","","",null,null,0,{"$nulls":3},"No"]
[null,713,{"$nulls":5},"",null,"",{"$nulls":4},"",null,"",null,"No",null,"","","","","","","","",null,null,0,{"$nulls":3},"No"]
[null,714,{"$nulls":5},"",null,"",{"$nulls":4},"",null,"",null,"No",null,"","","","","","","","",null,null,0,{"$nulls":3},"No"]
[null,715,{"$nulls":5},"",null,"",{"$nulls":4},"",null,"",null,"No",null,"","","","","","","","",null,null,0,{"$nulls":3},"No"]
[null,716,{"$nulls":5},"",null,"",{"$nulls":4},"",null,"",null,"No",null,"","","","","","","","",null,null,0,{"$nulls":3},"No",{"$nulls":6},"","",null,""]
[null,717,{"$nulls":5},"",null,"",{"$nulls":4},"",null,"",null,"No",null,"","","","","","","","",null,null,0,{"$nulls":3},"No"]
[null,718,{"$nulls":5},"",null,"",{"$nulls":4},"",null,"",null,"No",null,"","","","","","","","",null,null,0,{"$nulls":3},"No"]
[null,719,{"$nulls":5},"",null,"",{"$nulls":4},"",null,"",null,"No",null,"","","","","","","","",null,null,0,{"$nulls":3},"No"]
[null,720,{"$nulls":5},"",null,"",{"$nulls":4},"",null,"",null,"No",null,"","","","","","","","",null,null,0,{"$nulls":3},"No"]
[null,721,{"$nulls":5},"",null,"",{"$nulls":4},"",null,"",null,"No",null,"","","","","","","","",null,null,0,{"$nulls":3},"No"]
[null,722,{"$nulls":5},"",null,"",{"$nulls":4},"",null,"",null,"No",null,"","","","","","","","",null,null,0,{"$nulls":3},"No"]
[null,723,{"$nulls":5},"",null,"",{"$nulls":4},"",null,"",null,"No",null,"","","","","","","","",null,null,0,{"$nulls":3},"No",{"$nulls":6},"","",null,""]
[null,724,{"$nulls":5},"",null,"",{"$nulls":4},"",null,"",null,"No",null,"","","","","","","","",null,null,0,{"$nulls":3},"No"]
[null,725,{"$nulls":5},"",null,"",{"$nulls":4},"",null,"",null,"No",null,"","","","","","","","",null,null,0,{"$nulls":3},"No"]
[null,726,{"$nulls":5},"",null,"",{"$nulls":4},"",null,"",null,"No",null,"","","","","","","","",null,null,0,{"$nulls":3},"No"]
[null,727,{"$nulls":5},"",null,"",{"$nulls":4},"",null,"",null,"No",null,"","","","","","","","",null,null,0,{"$nulls":3},"No"]
[null,728,{"$nulls":5},"",null,"",{"$nulls":4},"",null,"",null,"No",null,"","","","","","","","",null,null,0,{"$nulls":3},"No"]
[null,729,{"$nulls":5},"",null,"",{"$nulls":4},"",null,"",null,"No",null,"","","","","","","","",null,null,0,{"$nulls":3},"No",{"$nulls":6},"","",null,""]
[null,730,{"$nulls":5},"",null,"",{"$nulls":4},"",null,"",null,"No",null,"","","","","","","","",null,null,0,{"$nulls":3},"No"]
[null,731,{"$nulls":5},"",null,"",{"$nulls":4},"",null,"",null,"No",null,"","","","","","","","",null,null,0,{"$nulls":3},"No"]
[null,732,{"$nulls":5},"",null,"",{"$nulls":4},"",null,"",null,"No",null,"","","","","","","","",null,null,0,{"$nulls":3},"No"]
[null,733,{"$nulls":5},"",null,"",{"$nulls":4},"",null,"",null,"No",null,"","","","","","","","",null,null,0,{"$nulls":3},"No"]
[null,734,{"$nulls":5},"",null,"",{"$nulls":4},"",null,"",null,"No",null,"","","","","","","","",null,null,0,{"$nulls":3},"No"]
[null,735,{"$nulls":5},"",null,"",{"$nulls":4},"",null,"",null,"No",null,"","","","","","","","",null,null,0,{"$nulls":3},"No"]
[null,736,{"$nulls":5},"",null,"",{"$nulls":4},"",null,"",null,"No",null,"","","","","","","","",null,null,0,{"$nulls":3},"No"]
[null,737,{"$nulls":5},"",null,"",{"$nulls":4},"",null,"",null,"No",null,"","","","","","","","",null,null,0,{"$nulls":3},"No"]
[null,738,{"$nulls":5},"",null,"",{"$nulls":4},"",null,"",null,"No",null,"","","","","","","","",null,null,0,{"$nulls":3},"No"]
[null,739,{"$nulls":5},"",null,"",{"$nulls":4},"",null,"",null,"No",null,"","","","","","","","",null,null,0,{"$nulls":3},"No"]
[null,740,{"$nulls":5},"",null,"",{"$nulls":4},"",null,"",null,"No",null,"","","","","","","","",null,null,0,{"$nulls":3},"No"]
[null,741,{"$nulls":5},"",null,"",{"$nulls":4},"",null,"",null,"No",null,"","","","","","","","",null,null,0,{"$nulls":3},"No",{"$nulls":6},"","",null,""]
[null,742,{"$nulls":5},"",null,"",{"$nulls":4},"",null,"",null,"No",null,"","","","","","","","",null,null,0,{"$nulls":3},"No"]
[null,743,{"$nulls":5},"",null,"",{"$nulls":4},"",null,"",null,"No",null,"","","","","","","","",null,null,0,{"$nulls":3},"No"]
[null,744,{"$nulls":5},"",null,"",{"$nulls":4},"",null,"",null,"No",null,"","","","","","","","",null,null,0,{"$nulls":3},"No"]
[null,745,{"$nulls":5},"",null,"",{"$nulls":4},"",null,"",null,"No",null,"","","","","","","","",null,null,0,{"$nulls":3},"No"]
[null,746,{"$nulls":5},"",null,"",{"$nulls":4},"",null,"",null,"No",null,"","","","","","","","",null,null,0,{"$nulls":3},"No"]
[null,747,{"$nulls":5},"",null,"",{"$nulls":4},"",null,"",null,"No",null,"","","","","","","","",null,null,0,{"$nulls":3},"No",{"$nulls":6},"","",null,""]
[null,748,{"$nulls":5},"",null,"",{"$nulls":4},"",null,"",null,"No",null,"","","","","","","","",null,null,0,{"$nulls":3},"No"]
[null,749,{"$nulls":5},"",null,"",{"$nulls":4},"",null,"",null,"No",null,"","","","","","","","",null,null,0,{"$nulls":3},"No"]
[null,750,{"$nulls":5},{"$f":"IF(E769=\"\",\"\",VLOOKUP(E769,$AO$1114:$AP$1541,2,FALSE))","v":""},null,"",{"$nulls":4},"",null,"",null,"No",null,"","","","","","","",{"$f":"IF(AA769=\"\",\"\",IF(AND(R769=\"Interior\",S769=\"No\",OR(T769=\"\",T769=\"No\")),$J$1027,IF(AND(R769=\"Interior\",S769=\"Yes\"),$J$1028,IF(AND(R769=\"Exterior\",S769=\"Yes\"),$J$1029,IF(AND(R769=\"Exterior\",S769=\"No\",N769<>G769),\"DNQ\",\"See Lighting Catalog to determine Code\")))))","v":""},null,null,0,{"$nulls":3},"No"]
[null,751,{"$nulls":5},"",null,"",{"$nulls":4},"",null,"",null,"No",null,"","","","","","","","",null,null,0,{"$nulls":3},"No"]
[null,752,{"$nulls":5},"",null,"",{"$nulls":4},"",null,"",null,"No",null,"","","","","","","","",null,null,0,{"$nulls":3},"No"]
[null,753,{"$nulls":5},"",null,"",{"$nulls":4},"",null,"",null,"No",null,"","","","","","","","",null,null,0,{"$nulls":3},"No"]
[null,754,{"$nulls":5},"",null,"",{"$nulls":4},"",null,"",null,"No",null,"","","","",{"$f":"IFERROR(IF(OR(I773>0,H773=\"Enter Watts\"),I773*G773,H773*G773)-IF(OR(P773>0,O773=\"Enter Watts\"),P773*N773,O773*N773),\"\")","v":""},"",{"$f":"IF(AND(V773=\"\",X773=\"\"),\"\",IF(OR(V773=\"\",X773=\"\"),0,V773-X773))","v":""},"",null,null,0,{"$nulls":3},"No"]
[null,755,{"$nulls":5},"",null,"",{"$nulls":4},"",null,"",null,"No",null,"","","","",{"$f":"IFERROR(IF(OR(I774>0,H774=\"Enter Watts\"),I774*G774,H774*G774)-IF(OR(P774>0,O774=\"Enter Watts\"),P774*N774,O774*N774),\"\")","v":""},"",{"$f":"IF(AND(V774=\"\",X774=\"\"),\"\",IF(OR(V774=\"\",X774=\"\"),0,V774-X774))","v":""},"",null,null,0,{"$nulls":3},"No"]
[null,756,{"$nulls":5},"",null,"",{"$nulls":4},"",null,"",null,"No",null,"","","","","","","","",null,null,0,{"$nulls":3},"No"]
[null,757,{"$nulls":5},"",null,"",{"$nulls":4},"",null,"",null,"No",null,"","","","","","","","",null,null,0,{"$nulls":3},"No"]
[null,758,{"$nulls":5},"",null,"",{"$nulls":4},"",null,"",null,"No",null,"","","","","","","","",null,null,0,{"$nulls":3},"No",{"$nulls":6},"","",null,""]
[null,759,{"$nulls":5},"",null,"",{"$nulls":4},"",null,"",null,"No",null,"","","","","","","","",null,null,0,{"$nulls":3},"No"]
[null,760,{"$nulls":5},"",null,"",{"$nulls":4},"",null,"",null,"No",null,"","","","","","","","",null,null,0,{"$nulls":3},"No"]
[null,761,{"$nulls":5},"",null,"",{"$nulls":4},"",null,"",null,"No",null,"","","","","","","","",null,null,0,{"$nulls":3},"No"]
[null,762,{"$nulls":5},"",null,"",{"$nulls":4},"",null,"",null,"No",null,"","","","","","","","",null,null,0,{"$nulls":3},"No"]
[null,763,{"$nulls":5},"",null,"",{"$nulls":4},"",null,"",null,"No",null,"","","","","","","","",null,null,0,{"$nulls":3},"No"]
[null,764,{"$nulls":5},"",null,"",{"$nulls":4},"",null,"",null,"No",null,"","","","","","","","",null,null,0,{"$nulls":3},"No",{"$nulls":6},"","",null,""]
[null,765,{"$nulls":5},"",null,"",{"$nulls":4},"",null,"",null,"No",null,"","","","","","","","",null,null,0,{"$nulls":3},"No"]
[null,766,{"$nulls":5},"",null,"",{"$nulls":4},"",null,"",null,"No",null,"","","","","","","","",null,null,0,{"$nulls":3},"No"]
[null,767,{"$nulls":5},"",null,"",{"$nulls":4},"",null,"",null,"No",null,"","","","","","","","",null,null,0,{"$nulls":3},"No"]
[null,768,{"$nulls":5},"",null,"",{"$nulls":4},"",null,"",null,"No",null,"","","","","","","","",null,null,0,{"$nulls":3},"No"]
[null,769,{"$nulls":5},"",null,{"$f":"IF(AND(E788<>\"\",G788<>\"\",$E$8=\"Default Sector Hours\"),VLOOKUP(IF(R788=\"Exterior\",\"Exterior\",$E$7),$V$1036:$W$1041,2,FALSE),\"\")","v":""},{"$nulls":4},{"$f":"IF(L788=\"\",\"\",VLOOKUP(L788,$AO$1113:$AP$1541,2,FALSE))","v":""},null,"",null,"No",null,"",{"$f":"IFERROR(IF(E788=\"\",\"\",G788/1000*IF(OR(I788>0,H788=\"Enter Watts\"),I788,H788)*IF(R788=\"Exterior\",$W$1041*(1-$G$15),IF($E$8=\"Manual Input\",J788,VLOOKUP($E$7,$V$1036:$Y$1040,2,FALSE))*(1-$E$15)      )),\"0\")","v":""},"",{"$f":"IFERROR(IF(AND(L788=\"\", E788=\"\"),\"\",N788/1000*IF(OR(P788>0,O788=\"Enter Watts\"),P788,O788)*IF(R788=\"Exterior\",$W$1041,IF($E$8=\"Manual Input\",Q788,VLOOKUP($E$7,$V$1036:$Y$1040,2,FALSE)))*IF(S788=\"Yes\",IF(R788=\"Exterior\",1-$Y$1041,1-VLOOKUP($E$7,$V$1036:$Y$1040,4,FALSE)),1)),0)","v":""},"","","","",null,null,0,{"$nulls":3},"No"]
[null,770,{"$nulls":5},"",null,"",{"$nulls":4},"",null,"",null,"No",null,{"$f":"IF(R789=\"Interior\",IF(E789=\"\",\"\",IF(OR(I789>0,H789=\"Enter Watts\"),I789*G789/1000*(1-$E$15),H789*G789/1000*(1-$E$15))),IF(E789=\"\",\"\",0))","v":""},"",{"$f":"IF(R789=\"Interior\",IF(AND(L789=\"\", E789=\"\"),\"\",IF(OR(P789>0,O789=\"Enter Watts\", P789=\"\"),P789*N789*(1-$Z$1036)/1000,O789*N789*(1-$Z$1036)/1000)),IF(AND(E789=\"\",L789=\"\"),\"\",0))","v":""},"","",{"$f":"IF(AND(U789=\"\",W789=\"\"),\"\",IF(OR(U789=\"\",W789=\"\"),0,  IF($E$8=\"Manual Input\",$G$9,   VLOOKUP($E$7,$V$1036:$Y$1041,3,FALSE))     *(U789-W789)))","v":""},"","",null,null,{"$f":"AD789*N789","v":0},{"$nulls":3},{"$f":"IF(_xlfn.ISFORMULA(J789)=TRUE,\"No\",\"Yes\")","v":"No"}]
[null,771,{"$nulls":5},"",null,"",{"$nulls":4},"",null,"",null,"No",null,"","","","","","","","",null,null,0,{"$nulls":3},"No",{"$nulls":6},"","",null,""]
[null,772,{"$nulls":5},"",null,"",{"$nulls":4},"",null,"",null,"No",null,"","","","","","","","",null,null,0,{"$nulls":3},"No"]
[null,773,{"$nulls":5},"",null,"",{"$nulls":4},"",null,"",null,"No",null,"","","","","","","","",null,null,0,{"$nulls":3},"No"]
[null,774,{"$nulls":5},"",null,"",{"$nulls":4},"",null,"",null,"No",null,"","","","","","","","",null,null,0,{"$nulls":3},"No"]
[null,775,{"$nulls":5},"",null,"",{"$nulls":4},"",null,"",null,"No",null,"","","","","","","","",null,null,0,{"$nulls":3},"No"]
[null,776,{"$nulls":5},"",null,"",{"$nulls":4},"",null,"",null,"No",null,"","","","","","","","",null,null,0,{"$nulls":3},"No"]
[null,777,{"$nulls":5},"",null,"",{"$nulls":4},"",null,"",null,"No",null,"","","","","","","","",null,null,0,{"$nulls":3},"No",{"$nulls":6},"","",null,""]
[null,778,{"$nulls":5},"",null,"",{"$nulls":4},"",null,"",null,"No",null,"","","","","","","","",null,null,0,{"$nulls":3},"No"]
[null,779,{"$nulls":5},"",null,"",{"$nulls":4},"",null,"",null,"No",null,"","","","","","","","",null,null,0,{"$nulls":3},"No"]
[null,780,{"$nulls":5},"",null,"",{"$nulls":4},"",null,"",null,"No",null,"","","","","","","","",null,null,0,{"$nulls":3},"No"]
[null,781,{"$nulls":5},"",null,"",{"$nulls":4},"",null,"",null,"No",null,"","","","","","","","",null,null,0,{"$nulls":3},"No"]
[null,782,{"$nulls":5},"",null,"",{"$nulls":4},"",null,"",null,"No",null,"","","","","","","","",null,null,0,{"$nulls":3},"No"]
[null,783,{"$nulls":5},"",null,"",{"$nulls":4},"",null,"",null,"No",null,"","","","","","","","",null,null,0,{"$nulls":3},"No"]
[null,784,{"$nulls":5},"",null,"",{"$nulls":4},"",null,"",null,"No",null,"","","","","","","","",null,null,0,{"$nulls":3},"No"]
[null,785,{"$nulls":5},"",null,"",{"$nulls":4},"",null,"",null,"No",null,"","","","","","","","",null,null,0,{"$nulls":3},"No"]
[null,786,{"$nulls":5},"",null,"",{"$nulls":4},"",null,"",null,"No",null,"","","","","","","","",null,null,0,{"$nulls":3},"No"]
[null,787,{"$nulls":5},"",null,"",{"$nulls":4},"",null,"",null,"No",null,"","","","","","","","",null,null,0,{"$nulls":3},"No"]
[null,788,{"$nulls":5},"",null,"",{"$nulls":4},"",null,"",null,"No",null,"","","","","","","","",null,null,0,{"$nulls":3},"No"]
[null,789,{"$nulls":5},"",null,"",{"$nulls":4},"",null,"",null,"No",null,"","","","","","","","",null,null,0,{"$nulls":3},"No",{"$nulls":6},"","",null,""]
[null,790,{"$nulls":5},"",null,"",{"$nulls":4},"",null,"",null,"No",null,"","","","","","","","",null,null,0,{"$nulls":3},"No"]
[null,791,{"$nulls":5},"",null,"",{"$nulls":4},"",null,"",null,"No",null,"","","","","","","","",null,null,0,{"$nulls":3},"No"]
[null,792,{"$nulls":5},"",null,"",{"$nulls":4},"",null,"",null,"No",null,"","","","","","","","",null,null,0,{"$nulls":3},"No"]
[null,793,{"$nulls":5},"",null,"",{"$nulls":4},"",null,"",null,"No",null,"","","","","","","","",null,null,0,{"$nulls":3},"No"]
[null,794,{"$nulls":5},"",null,"",{"$nulls":4},"",null,"",null,"No",null,"","","","","","","","",null,null,0,{"$nulls":3},"No"]
[null,795,{"$nulls":5},"",null,"",{"$nulls":4},"",null,"",null,"No",null,"","","","","","","","",null,null,0,{"$nulls":3},"No",{"$nulls":6},"","",null,""]
[null,796,{"$nulls":5},"",null,"",{"$nulls":4},"",null,"",null,"No",null,"","","","","","","","",null,null,0,{"$nulls":3},"No"]
[null,797,{"$nulls":5},"",null,"",{"$nulls":4},"",null,"",null,"No",null,"","","","","","","","",null,null,0,{"$nulls":3},"No"]
[null,798,{"$nulls":5},"",null,"",{"$nulls":4},"",null,"",null,"No",null,"","","","","","","","",null,null,0,{"$nulls":3},"No"]
[null,799,{"$nulls":5},"",null,"",{"$nulls":4},"",null,"",null,"No",null,"","","","","","","","",null,null,0,{"$nulls":3},"No"]
[null,800,{"$nulls":5},"",null,"",{"$nulls":4},"",null,"",null,"No",null,"","","","","","","","",null,null,0,{"$nulls":3},"No"]
[null,801,{"$nulls":5},"",null,"",{"$nulls":4},"",null,"",null,"No",null,"","","","","","","","",null,null,0,{"$nulls":3},"No"]
[null,802,{"$nulls":5},"",null,"",{"$nulls":4},"",null,"",null,"No",null,"","","","",{"$f":"IFERROR(IF(OR(I821>0,H821=\"Enter Watts\"),I821*G821,H821*G821)-IF(OR(P821>0,O821=\"Enter Watts\"),P821*N821,O821*N821),\"\")","v":""},"",{"$f":"IF(AND(V821=\"\",X821=\"\"),\"\",IF(OR(V821=\"\",X821=\"\"),0,V821-X821))","v":""},"",null,null,0,{"$nulls":3},"No"]
[null,803,{"$nulls":5},"",null,"",{"$nulls":4},"",null,"",null,"No",null,"","","","",{"$f":"IFERROR(IF(OR(I822>0,H822=\"Enter Watts\"),I822*G822,H822*G822)-IF(OR(P822>0,O822=\"Enter Watts\"),P822*N822,O822*N822),\"\")","v":""},"",{"$f":"IF(AND(V822=\"\",X822=\"\"),\"\",IF(OR(V822=\"\",X822=\"\"),0,V822-X822))","v":""},"",null,null,0,{"$nulls":3},"No"]
[null,804,{"$nulls":5},"",null,"",{"$nulls":4},"",null,"",null,"No",null,"","","","","","","","",null,null,0,{"$nulls":3},"No"]
[null,805,{"$nulls":5},"",null,"",{"$nulls":4},"",null,"",null,"No",null,"","","","","","","","",null,null,0,{"$nulls":3},"No"]
[null,806,{"$nulls":5},"",null,"",{"$nulls":4},"",null,"",null,"No",null,"","","","","","","","",null,null,0,{"$nulls":3},"No",{"$nulls":6},"","",null,""]
[null,807,{"$nulls":5},"",null,"",{"$nulls":4},"",null,"",null,"No",null,"","","","","","","","",null,null,0,{"$nulls":3},"No"]
[null,808,{"$nulls":5},"",null,"",{"$nulls":4},"",null,"",null,"No",null,"","","","","","","","",null,null,0,{"$nulls":3},"No"]
[null,809,{"$nulls":5},"",null,"",{"$nulls":4},"",null,"",null,"No",null,"","","","","","","","",null,null,0,{"$nulls":3},"No"]
[null,810,{"$nulls":5},"",null,"",{"$nulls":4},"",null,"",null,"No",null,"","","","","","","","",null,null,0,{"$nulls":3},"No"]
[null,811,{"$nulls":5},"",null,"",{"$nulls":4},"",null,"",null,"No",null,"","","","","","","","",null,null,0,{"$nulls":3},"No"]
[null,812,{"$nulls":5},"",null,"",{"$nulls":4},"",null,"",null,"No",null,"","","","","","","","",null,null,0,{"$nulls":3},"No",{"$nulls":6},"","",null,""]
[null,813,{"$nulls":5},"",null,"",{"$nulls":4},"",null,"",null,"No",null,"","","","","","","","",null,null,0,{"$nulls":3},"No"]
[null,814,{"$nulls":5},{"$f":"IF(E833=\"\",\"\",VLOOKUP(E833,$AO$1114:$AP$1541,2,FALSE))","v":""},null,"",{"$nulls":4},"",null,"",null,"No",null,"","","","","","","",{"$f":"IF(AA833=\"\",\"\",IF(AND(R833=\"Interior\",S833=\"No\",OR(T833=\"\",T833=\"No\")),$J$1027,IF(AND(R833=\"Interior\",S833=\"Yes\"),$J$1028,IF(AND(R833=\"Exterior\",S833=\"Yes\"),$J$1029,IF(AND(R833=\"Exterior\",S833=\"No\",N833<>G833),\"DNQ\",\"See Lighting Catalog to determine Code\")))))","v":""},null,null,0,{"$nulls":3},"No"]
[null,815,{"$nulls":5},"",null,"",{"$nulls":4},"",null,"",null,"No",null,"","","","","","","","",null,null,0,{"$nulls":3},"No"]
[null,816,{"$nulls":5},"",null,"",{"$nulls":4},"",null,"",null,"No",null,"","","","","","","","",null,null,0,{"$nulls":3},"No"]
[null,817,{"$nulls":5},"",null,"",{"$nulls":4},"",null,"",null,"No",null,"","","","","","","","",null,null,0,{"$nulls":3},"No"]
[null,818,{"$nulls":5},"",null,"",{"$nulls":4},"",null,"",null,"No",null,"","","","","","","","",null,null,0,{"$nulls":3},"No"]
[null,819,{"$nulls":5},"",null,"",{"$nulls":4},"",null,"",null,"No",null,"","","","","","","","",null,null,0,{"$nulls":3},"No",{"$nulls":6},"","",null,""]
[null,820,{"$nulls":5},"",null,"",{"$nulls":4},"",null,"",null,"No",null,"","","","","","","","",null,null,0,{"$nulls":3},"No"]
[null,821,{"$nulls":5},"",null,"",{"$nulls":4},"",null,"",null,"No",null,"","","","","","","","",null,null,0,{"$nulls":3},"No"]
[null,822,{"$nulls":5},"",null,"",{"$nulls":4},"",null,"",null,"No",null,"","","","","","","","",null,null,0,{"$nulls":3},"No"]
[null,823,{"$nulls":5},"",null,"",{"$nulls":4},"",null,"",null,"No",null,"","","","","","","","",null,null,0,{"$nulls":3},"No"]
[null,824,{"$nulls":5},"",null,"",{"$nulls":4},"",null,"",null,"No",null,"","","","","","","","",null,null,0,{"$nulls":3},"No"]
[null,825,{"$nulls":5},"",null,"",{"$nulls":4},"",null,"",null,"No",null,"","","","","","","","",null,null,0,{"$nulls":3},"No",{"$nulls":6},"","",null,""]
[null,826,{"$nulls":5},"",null,"",{"$nulls":4},"",null,"",null,"No",null,"","","","","","","","",null,null,0,{"$nulls":3},"No"]
[null,827,{"$nulls":5},"",null,"",{"$nulls":4},"",null,"",null,"No",null,"","","","","","","","",null,null,0,{"$nulls":3},"No"]
[null,828,{"$nulls":5},"",null,"",{"$nulls":4},"",null,"",null,"No",null,"","","","","","","","",null,null,0,{"$nulls":3},"No"]
[null,829,{"$nulls":5},"",null,"",{"$nulls":4},"",null,"",null,"No",null,"","","","","","","","",null,null,0,{"$nulls":3},"No"]
[null,830,{"$nulls":5},"",null,"",{"$nulls":4},"",null,"",null,"No",null,"","","","","","","","",null,null,0,{"$nulls":3},"No"]
[null,831,{"$nulls":5},"",null,"",{"$nulls":4},"",null,"",null,"No",null,"","","","","","","","",null,null,0,{"$nulls":3},"No"]
[null,832,{"$nulls":5},"",null,"",{"$nulls":4},"",null,"",null,"No",null,"","","","","","","","",null,null,0,{"$nulls":3},"No"]
[null,833,{"$nulls":5},"",null,{"$f":"IF(AND(E852<>\"\",G852<>\"\",$E$8=\"Default Sector Hours\"),VLOOKUP(IF(R852=\"Exterior\",\"Exterior\",$E$7),$V$1036:$W$1041,2,FALSE),\"\")","v":""},{"$nulls":4},{"$f":"IF(L852=\"\",\"\",VLOOKUP(L852,$AO$1113:$AP$1541,2,FALSE))","v":""},null,"",null,"No",null,"",{"$f":"IFERROR(IF(E852=\"\",\"\",G852/1000*IF(OR(I852>0,H852=\"Enter Watts\"),I852,H852)*IF(R852=\"Exterior\",$W$1041*(1-$G$15),IF($E$8=\"Manual Input\",J852,VLOOKUP($E$7,$V$1036:$Y$1040,2,FALSE))*(1-$E$15)      )),\"0\")","v":""},"",{"$f":"IFERROR(IF(AND(L852=\"\", E852=\"\"),\"\",N852/1000*IF(OR(P852>0,O852=\"Enter Watts\"),P852,O852)*IF(R852=\"Exterior\",$W$1041,IF($E$8=\"Manual Input\",Q852,VLOOKUP($E$7,$V$1036:$Y$1040,2,FALSE)))*IF(S852=\"Yes\",IF(R852=\"Exterior\",1-$Y$1041,1-VLOOKUP($E$7,$V$1036:$Y$1040,4,FALSE)),1)),0)","v":""},"","","","",null,null,0,{"$nulls":3},"No"]
[null,834,{"$nulls":5},"",null,"",{"$nulls":4},"",null,"",null,"No",null,{"$f":"IF(R853=\"Interior\",IF(E853=\"\",\"\",IF(OR(I853>0,H853=\"Enter Watts\"),I853*G853/1000*(1-$E$15),H853*G853/1000*(1-$E$15))),IF(E853=\"\",\"\",0))","v":""},"",{"$f":"IF(R853=\"Interior\",IF(AND(L853=\"\", E853=\"\"),\"\",IF(OR(P853>0,O853=\"Enter Watts\", P853=\"\"),P853*N853*(1-$Z$1036)/1000,O853*N853*(1-$Z$1036)/1000)),IF(AND(E853=\"\",L853=\"\"),\"\",0))","v":""},"","",{"$f":"IF(AND(U853=\"\",W853=\"\"),\"\",IF(OR(U853=\"\",W853=\"\"),0,  IF($E$8=\"Manual Input\",$G$9,   VLOOKUP($E$7,$V$1036:$Y$1041,3,FALSE))     *(U853-W853)))","v":""},"","",null,null,{"$f":"AD853*N853","v":0},{"$nulls":3},{"$f":"IF(_xlfn.ISFORMULA(J853)=TRUE,\"No\",\"Yes\")","v":"No"}]
[null,835,{"$nulls":5},"",null,"",{"$nulls":4},"",null,"",null,"No",null,"","","","","","","","",null,null,0,{"$nulls":3},"No"]
[null,836,{"$nulls":5},"",null,"",{"$nulls":4},"",null,"",null,"No",null,"","","","","","","","",null,null,0,{"$nulls":3},"No"]
[null,837,{"$nulls":5},"",null,"",{"$nulls":4},"",null,"",null,"No",null,"","","","","","","","",null,null,0,{"$nulls":3},"No",{"$nulls":6},"","",null,""]
[null,838,{"$nulls":5},"",null,"",{"$nulls":4},"",null,"",null,"No",null,"","","","","","","","",null,null,0,{"$nulls":3},"No"]
[null,839,{"$nulls":5},"",null,"",{"$nulls":4},"",null,"",null,"No",null,"","","","","","","","",null,null,0,{"$nulls":3},"No"]
[null,840,{"$nulls":5},"",null,"",{"$nulls":4},"",null,"",null,"No",null,"","","","","","","","",null,null,0,{"$nulls":3},"No"]
[null,841,{"$nulls":5},"",null,"",{"$nulls":4},"",null,"",null,"No",null,"","","","","","","","",null,null,0,{"$nulls":3},"No"]
[null,842,{"$nulls":5},"",null,"",{"$nulls":4},"",null,"",null,"No",null,"","","","","","","","",null,null,0,{"$nulls":3},"No"]
[null,843,{"$nulls":5},"",null,"",{"$nulls":4},"",null,"",null,"No",null,"","","","","","","","",null,null,0,{"$nulls":3},"No",{"$nulls":6},"","",null,""]
[null,844,{"$nulls":5},"",null,"",{"$nulls":4},"",null,"",null,"No",null,"","","","","","","","",null,null,0,{"$nulls":3},"No"]
[null,845,{"$nulls":5},"",null,"",{"$nulls":4},"",null,"",null,"No",null,"","","","","","","","",null,null,0,{"$nulls":3},"No"]
[null,846,{"$nulls":5},"",null,"",{"$nulls":4},"",null,"",null,"No",null,"","","","","","","","",null,null,0,{"$nulls":3},"No"]
[null,847,{"$nulls":5},"",null,"",{"$nulls":4},"",null,"",null,"No",null,"","","","","","","","",null,null,0,{"$nulls":3},"No"]
[null,848,{"$nulls":5},"",null,"",{"$nulls":4},"",null,"",null,"No",null,"","","","","","","","",null,null,0,{"$nulls":3},"No"]
[null,849,{"$nulls":5},"",null,"",{"$nulls":4},"",null,"",null,"No",null,"","","","","","","","",null,null,0,{"$nulls":3},"No"]
[null,850,{"$nulls":5},"",null,"",{"$nulls":4},"",null,"",null,"No",null,"","","","",{"$f":"IFERROR(IF(OR(I869>0,H869=\"Enter Watts\"),I869*G869,H869*G869)-IF(OR(P869>0,O869=\"Enter Watts\"),P869*N869,O869*N869),\"\")","v":""},"",{"$f":"IF(AND(V869=\"\",X869=\"\"),\"\",IF(OR(V869=\"\",X869=\"\"),0,V869-X869))","v":""},"",null,null,0,{"$nulls":3},"No"]
[null,851,{"$nulls":5},"",null,"",{"$nulls":4},"",null,"",null,"No",null,"","","","",{"$f":"IFERROR(IF(OR(I870>0,H870=\"Enter Watts\"),I870*G870,H870*G870)-IF(OR(P870>0,O870=\"Enter Watts\"),P870*N870,O870*N870),\"\")","v":""},"",{"$f":"IF(AND(V870=\"\",X870=\"\"),\"\",IF(OR(V870=\"\",X870=\"\"),0,V870-X870))","v":""},"",null,null,0,{"$nulls":3},"No"]
[null,852,{"$nulls":5},"",null,"",{"$nulls":4},"",null,"",null,"No",null,"","","","","","","","",null,null,0,{"$nulls":3},"No"]
[null,853,{"$nulls":5},"",null,"",{"$nulls":4},"",null,"",null,"No",null,"","","","","","","","",null,null,0,{"$nulls":3},"No"]
[null,854,{"$nulls":5},"",null,"",{"$nulls":4},"",null,"",null,"No",null,"","","","","","","","",null,null,0,{"$nulls":3},"No",{"$nulls":6},"","",null,""]
[null,855,{"$nulls":5},"",null,"",{"$nulls":4},"",null,"",null,"No",null,"","","","","","","","",null,null,0,{"$nulls":3},"No"]
[null,856,{"$nulls":5},"",null,"",{"$nulls":4},"",null,"",null,"No",null,"","","","","","","","",null,null,0,{"$nulls":3},"No"]
[null,857,{"$nulls":5},"",null,"",{"$nulls":4},"",null,"",null,"No",null,"","","","","","","","",null,null,0,{"$nulls":3},"No"]
[null,858,{"$nulls":5},"",null,"",{"$nulls":4},"",null,"",null,"No",null,"","","","","","","","",null,null,0,{"$nulls":3},"No"]
[null,859,{"$nulls":5},"",null,"",{"$nulls":4},"",null,"",null,"No",null,"","","","","","","","",null,null,0,{"$nulls":3},"No"]
[null,860,{"$nulls":5},"",null,"",{"$nulls":4},"",null,"",null,"No",null,"","","","","","","","",null,null,0,{"$nulls":3},"No",{"$nulls":6},"","",null,""]
[null,861,{"$nulls":5},"",null,"",{"$nulls":4},"",null,"",null,"No",null,"","","","","","","","",null,null,0,{"$nulls":3},"No"]
[null,862,{"$nulls":5},"",null,"",{"$nulls":4},"",null,"",null,"No",null,"","","","","","","","",null,null,0,{"$nulls":3},"No"]
[null,863,{"$nulls":5},"",null,"",{"$nulls":4},"",null,"",null,"No",null,"","","","","","","","",null,null,0,{"$nulls":3},"No"]
[null,864,{"$nulls":5},"",null,"",{"$nulls":4},"",null,"",null,"No",null,"","","","","","","","",null,null,0,{"$nulls":3},"No"]
[null,865,{"$nulls":5},"",null,"",{"$nulls":4},"",null,"",null,"No",null,"","","","","","","","",null,null,0,{"$nulls":3},"No"]
[null,866,{"$nulls":5},"",null,"",{"$nulls":4},"",null,"",null,"No",null,"","","","","","","","",null,null,0,{"$nulls":3},"No"]
[null,867,{"$nulls":5},"",null,"",{"$nulls":4},"",null,"",null,"No",null,"","","","","","","","",null,null,0,{"$nulls":3},"No",{"$nulls":6},"","",null,""]
[null,868,{"$nulls":5},"",null,"",{"$nulls":4},"",null,"",null,"No",null,"","","","","","","","",null,null,0,{"$nulls":3},"No"]
[null,869,{"$nulls":5},"",null,"",{"$nulls":4},"",null,"",null,"No",null,"","","","","","","","",null,null,0,{"$nulls":3},"No"]
[null,870,{"$nulls":5},"",null,"",{"$nulls":4},"",null,"",null,"No",null,"","","","","","","","",null,null,0,{"$nulls":3},"No"]
[null,871,{"$nulls":5},"",null,"",{"$nulls":4},"",null,"",null,"No",null,"","","","","","","","",null,null,0,{"$nulls":3},"No"]
[null,872,{"$nulls":5},"",null,"",{"$nulls":4},"",null,"",null,"No",null,"","","","","","","","",null,null,0,{"$nulls":3},"No"]
[null,873,{"$nulls":5},"",null,"",{"$nulls":4},"",null,"",null,"No",null,"","","","","","","","",null,null,0,{"$nulls":3},"No",{"$nulls":6},"","",null,""]
[null,874,{"$nulls":5},"",null,"",{"$nulls":4},"",null,"",null,"No",null,"","","","","","","","",null,null,0,{"$nulls":3},"No"]
[null,875,{"$nulls":5},"",null,"",{"$nulls":4},"",null,{"$f":"IF(J894=\"\",\"\",J894)","v":""},null,"No",null,"","","","","","","","",null,null,0,{"$nulls":3},"No"]
[null,876,{"$nulls":5},"",null,"",{"$nulls":4},"",null,"",null,"No",null,"","","","","","","","",null,null,0,{"$nulls":3},"No"]
[null,877,{"$nulls":5},"",null,"",{"$nulls":4},"",null,"",null,"No",null,"","","","","","","","",null,null,0,{"$nulls":3},"No"]
[null,878,{"$nulls":5},{"$f":"IF(E897=\"\",\"\",VLOOKUP(E897,$AO$1114:$AP$1541,2,FALSE))","v":""},null,"",{"$nulls":4},"",null,"",null,"No",null,"","","","","","","",{"$f":"IF(AA897=\"\",\"\",IF(AND(R897=\"Interior\",S897=\"No\",OR(T897=\"\",T897=\"No\")),$J$1027,IF(AND(R897=\"Interior\",S897=\"Yes\"),$J$1028,IF(AND(R897=\"Exterior\",S897=\"Yes\"),$J$1029,IF(AND(R897=\"Exterior\",S897=\"No\",N897<>G897),\"DNQ\",\"See Lighting Catalog to determine Code\")))))","v":""},null,null,0,{"$nulls":3},"No"]
[null,879,{"$nulls":5},"",null,"",{"$nulls":4},"",null,"",null,"No",null,"","","","","","","","",null,null,0,{"$nulls":3},"No",{"$nulls":6},"","",null,""]
[null,880,{"$nulls":5},"",null,"",{"$nulls":4},"",null,"",null,"No",null,"","","","","","","","",null,null,0,{"$nulls":3},"No"]
[null,881,{"$nulls":5},"",null,"",{"$nulls":4},"",null,"",null,"No",null,"","","","","","","","",null,null,0,{"$nulls":3},"No"]
[null,882,{"$nulls":5},"",null,"",{"$nulls":4},"",null,"",null,"No",null,"","","","","","","","",null,null,0,{"$nulls":3},"No"]
[null,883,{"$nulls":5},"",null,"",{"$nulls":4},"",null,"",null,"No",null,"","","","","","","","",null,null,0,{"$nulls":3},"No"]
[null,884,{"$nulls":5},"",null,"",{"$nulls":4},"",null,"",null,"No",null,"","","","","","","","",null,null,0,{"$nulls":3},"No"]
[null,885,{"$nulls":5},"",null,"",{"$nulls":4},"",null,"",null,"No",null,"","","","","","","","",null,null,0,{"$nulls":3},"No"]
[null,886,{"$nulls":5},"",null,"",{"$nulls":4},"",null,"",null,"No",null,"","","","","","","","",null,null,0,{"$nulls":3},"No"]
[null,887,{"$nulls":5},"",null,"",{"$nulls":4},"",null,"",null,"No",null,"","","","","","","","",null,null,0,{"$nulls":3},"No"]
[null,888,{"$nulls":5},"",null,"",{"$nulls":4},"",null,"",null,"No",null,"","","","","","","","",null,null,0,{"$nulls":3},"No"]
[null,889,{"$nulls":5},"",null,"",{"$nulls":4},"",null,"",null,"No",null,"","","","","","","","",null,null,0,{"$nulls":3},"No"]
[null,890,{"$nulls":5},"",null,"",{"$nulls":4},"",null,"",null,"No",null,"","","","","","","","",null,null,0,{"$nulls":3},"No"]
[null,891,{"$nulls":5},"",null,"",{"$nulls":4},"",null,"",null,"No",null,"","","","","","","","",null,null,0,{"$nulls":3},"No",{"$nulls":6},"","",null,""]
[null,892,{"$nulls":5},"",null,"",{"$nulls":4},"",null,"",null,"No",null,"","","","","","","","",null,null,0,{"$nulls":3},"No"]
[null,893,{"$nulls":5},"",null,"",{"$nulls":4},"",null,"",null,"No",null,"","","","","","","","",null,null,0,{"$nulls":3},"No"]
[null,894,{"$nulls":5},"",null,"",{"$nulls":4},"",null,"",null,"No",null,"","","","","","","","",null,null,0,{"$nulls":3},"No"]
[null,895,{"$nulls":5},"",null,"",{"$nulls":4},"",null,"",null,"No",null,"","","","","","","","",null,null,0,{"$nulls":3},"No"]
[null,896,{"$nulls":5},"",null,"",{"$nulls":4},"",null,"",null,"No",null,"","","","","","","","",null,null,0,{"$nulls":3},"No"]
[null,897,{"$nulls":5},"",null,{"$f":"IF(AND(E916<>\"\",G916<>\"\",$E$8=\"Default Sector Hours\"),VLOOKUP(IF(R916=\"Exterior\",\"Exterior\",$E$7),$V$1036:$W$1041,2,FALSE),\"\")","v":""},{"$nulls":4},{"$f":"IF(L916=\"\",\"\",VLOOKUP(L916,$AO$1113:$AP$1541,2,FALSE))","v":""},null,"",null,"No",null,"",{"$f":"IFERROR(IF(E916=\"\",\"\",G916/1000*IF(OR(I916>0,H916=\"Enter Watts\"),I916,H916)*IF(R916=\"Exterior\",$W$1041*(1-$G$15),IF($E$8=\"Manual Input\",J916,VLOOKUP($E$7,$V$1036:$Y$1040,2,FALSE))*(1-$E$15)      )),\"0\")","v":""},"",{"$f":"IFERROR(IF(AND(L916=\"\", E916=\"\"),\"\",N916/1000*IF(OR(P916>0,O916=\"Enter Watts\"),P916,O916)*IF(R916=\"Exterior\",$W$1041,IF($E$8=\"Manual Input\",Q916,VLOOKUP($E$7,$V$1036:$Y$1040,2,FALSE)))*IF(S916=\"Yes\",IF(R916=\"Exterior\",1-$Y$1041,1-VLOOKUP($E$7,$V$1036:$Y$1040,4,FALSE)),1)),0)","v":""},"","","","",null,null,0,{"$nulls":3},"No",{"$nulls":6},"","",null,""]
[null,898,{"$nulls":5},"",null,"",{"$nulls":4},"",null,"",null,"No",null,{"$f":"IF(R917=\"Interior\",IF(E917=\"\",\"\",IF(OR(I917>0,H917=\"Enter Watts\"),I917*G917/1000*(1-$E$15),H917*G917/1000*(1-$E$15))),IF(E917=\"\",\"\",0))","v":""},"",{"$f":"IF(R917=\"Interior\",IF(AND(L917=\"\", E917=\"\"),\"\",IF(OR(P917>0,O917=\"Enter Watts\", P917=\"\"),P917*N917*(1-$Z$1036)/1000,O917*N917*(1-$Z$1036)/1000)),IF(AND(E917=\"\",L917=\"\"),\"\",0))","v":""},"","",{"$f":"IF(AND(U917=\"\",W917=\"\"),\"\",IF(OR(U917=\"\",W917=\"\"),0,  IF($E$8=\"Manual Input\",$G$9,   VLOOKUP($E$7,$V$1036:$Y$1041,3,FALSE))     *(U917-W917)))","v":""},"","",null,null,{"$f":"AD917*N917","v":0},{"$nulls":3},{"$f":"IF(_xlfn.ISFORMULA(J917)=TRUE,\"No\",\"Yes\")","v":"No"}]
[null,899,{"$nulls":5},"",null,"",{"$nulls":4},"",null,"",null,"No",null,"","","","","","","","",null,null,0,{"$nulls":3},"No"]
[null,900,{"$nulls":5},"",null,"",{"$nulls":4},"",null,"",null,"No",null,"","","","","","","","",null,null,0,{"$nulls":3},"No"]
[null,901,{"$nulls":5},"",null,"",{"$nulls":4},"",null,"",null,"No",null,"","","","","","","","",null,null,0,{"$nulls":3},"No"]
[null,902,{"$nulls":5},"",null,"",{"$nulls":4},"",null,"",null,"No",null,"","","","","","","","",null,null,0,{"$nulls":3},"No"]
[null,903,{"$nulls":5},"",null,"",{"$nulls":4},"",null,"",null,"No",null,"","","","","","","","",null,null,0,{"$nulls":3},"No"]
[null,904,{"$nulls":5},"",null,"",{"$nulls":4},"",null,"",null,"No",null,"","","","",{"$f":"IFERROR(IF(OR(I923>0,H923=\"Enter Watts\"),I923*G923,H923*G923)-IF(OR(P923>0,O923=\"Enter Watts\"),P923*N923,O923*N923),\"\")","v":""},"",{"$f":"IF(AND(V923=\"\",X923=\"\"),\"\",IF(OR(V923=\"\",X923=\"\"),0,V923-X923))","v":""},"",null,null,0,{"$nulls":3},"No"]
[null,905,{"$nulls":5},"",null,"",{"$nulls":4},"",null,"",null,"No",null,"","","","",{"$f":"IFERROR(IF(OR(I924>0,H924=\"Enter Watts\"),I924*G924,H924*G924)-IF(OR(P924>0,O924=\"Enter Watts\"),P924*N924,O924*N924),\"\")","v":""},"",{"$f":"IF(AND(V924=\"\",X924=\"\"),\"\",IF(OR(V924=\"\",X924=\"\"),0,V924-X924))","v":""},"",null,null,0,{"$nulls":3},"No"]
[null,906,{"$nulls":5},"",null,"",{"$nulls":4},"",null,"",null,"No",null,"","","","","","","","",null,null,0,{"$nulls":3},"No"]
[null,907,{"$nulls":5},"",null,"",{"$nulls":4},"",null,"",null,"No",null,"","","","","","","","",null,null,0,{"$nulls":3},"No"]
[null,908,{"$nulls":5},"",null,"",{"$nulls":4},"",null,"",null,"No",null,"","","","","","","","",null,null,0,{"$nulls":3},"No",{"$nulls":6},"","",null,""]
[null,909,{"$nulls":5},"",null,"",{"$nulls":4},"",null,"",null,"No",null,"","","","","","","","",null,null,0,{"$nulls":3},"No"]
[null,910,{"$nulls":5},"",null,"",{"$nulls":4},"",null,"",null,"No",null,"","","","","","","","",null,null,0,{"$nulls":3},"No"]
[null,911,{"$nulls":5},"",null,"",{"$nulls":4},"",null,"",null,"No",null,"","","","","","","","",null,null,0,{"$nulls":3},"No"]
[null,912,{"$nulls":5},"",null,"",{"$nulls":4},"",null,"",null,"No",null,"","","","","","","","",null,null,0,{"$nulls":3},"No"]
[null,913,{"$nulls":5},"",null,"",{"$nulls":4},"",null,"",null,"No",null,"","","","","","","","",null,null,0,{"$nulls":3},"No"]
[null,914,{"$nulls":5},"",null,"",{"$nulls":4},"",null,"",null,"No",null,"","","","","","","","",null,null,0,{"$nulls":3},"No",{"$nulls":6},"","",null,""]
[null,915,{"$nulls":5},"",null,"",{"$nulls":4},"",null,"",null,"No",null,"","","","","","","","",null,null,0,{"$nulls":3},"No"]
[null,916,{"$nulls":5},"",null,"",{"$nulls":4},"",null,"",null,"No",null,"","","","","","","","",null,null,0,{"$nulls":3},"No"]
[null,917,{"$nulls":5},"",null,"",{"$nulls":4},"",null,"",null,"No",null,"","","","","","","","",null,null,0,{"$nulls":3},"No"]
[null,918,{"$nulls":5},"",null,"",{"$nulls":4},"",null,"",null,"No",null,"","","","","","","","",null,null,0,{"$nulls":3},"No"]
[null,919,{"$nulls":5},"",null,"",{"$nulls":4},"",null,"",null,"No",null,"","","","","","","","",null,null,0,{"$nulls":3},"No"]
[null,920,{"$nulls":5},"",null,"",{"$nulls":4},"",null,"",null,"No",null,"","","","","","","","",null,null,0,{"$nulls":3},"No"]
[null,921,{"$nulls":5},"",null,"",{"$nulls":4},"",null,"",null,"No",null,"","","","","","","","",null,null,0,{"$nulls":3},"No",{"$nulls":6},"","",null,""]
[null,922,{"$nulls":5},"",null,"",{"$nulls":4},"",null,"",null,"No",null,"","","","","","","","",null,null,0,{"$nulls":3},"No"]
[null,923,{"$nulls":5},"",null,"",{"$nulls":4},"",null,"",null,"No",null,"","","","","","","","",null,null,0,{"$nulls":3},"No"]
[null,924,{"$nulls":5},"",null,"",{"$nulls":4},"",null,"",null,"No",null,"","","","","","","","",null,null,0,{"$nulls":3},"No"]
[null,925,{"$nulls":5},"",null,"",{"$nulls":4},"",null,"",null,"No",null,"","","","","","","","",null,null,0,{"$nulls":3},"No"]
[null,926,{"$nulls":5},"",null,"",{"$nulls":4},"",null,"",null,"No",null,"","","","","","","","",null,null,0,{"$nulls":3},"No"]
[null,927,{"$nulls":5},"",null,"",{"$nulls":4},"",null,"",null,"No",null,"","","","","","","","",null,null,0,{"$nulls":3},"No",{"$nulls":6},"","",null,""]
[null,928,{"$nulls":5},"",null,"",{"$nulls":4},"",null,"",null,"No",null,"","","","","","","","",null,null,0,{"$nulls":3},"No"]
[null,929,{"$nulls":5},"",null,"",{"$nulls":4},"",null,"",null,"No",null,"","","","","","","","",null,null,0,{"$nulls":3},"No"]
[null,930,{"$nulls":5},"",null,"",{"$nulls":4},"",null,"",null,"No",null,"","","","","","","","",null,null,0,{"$nulls":3},"No"]
[null,931,{"$nulls":5},"",null,"",{"$nulls":4},"",null,"",null,"No",null,"","","","","","","","",null,null,0,{"$nulls":3},"No"]
[null,932,{"$nulls":5},"",null,"",{"$nulls":4},"",null,"",null,"No",null,"","","","","","","","",null,null,0,{"$nulls":3},"No"]
[null,933,{"$nulls":5},"",null,"",{"$nulls":4},"",null,"",null,"No",null,"","","","","","","","",null,null,0,{"$nulls":3},"No"]
[null,934,{"$nulls":5},"",null,"",{"$nulls":4},"",null,"",null,"No",null,"","","","","","","","",null,null,0,{"$nulls":3},"No"]
[null,935,{"$nulls":5},"",null,"",{"$nulls":4},"",null,"",null,"No",null,"","","","","","","","",null,null,0,{"$nulls":3},"No"]
[null,936,{"$nulls":5},"",null,"",{"$nulls":4},"",null,"",null,"No",null,"","","","","","","","",null,null,0,{"$nulls":3},"No"]
[null,937,{"$nulls":5},"",null,"",{"$nulls":4},"",null,"",null,"No",null,"","","","","","","","",null,null,0,{"$nulls":3},"No"]
[null,938,{"$nulls":5},"",null,"",{"$nulls":4},"",null,"",null,"No",null,"","","","","","","","",null,null,0,{"$nulls":3},"No"]
[null,939,{"$nulls":5},"",null,"",{"$nulls":4},"",null,"",null,"No",null,"","","","","","","","",null,null,0,{"$nulls":3},"No",{"$nulls":6},"","",null,""]
[null,940,{"$nulls":5},"",null,"",{"$nulls":4},"",null,"",null,"No",null,"","","","","","","","",null,null,0,{"$nulls":3},"No"]
[null,941,{"$nulls":5},"",null,"",{"$nulls":4},"",null,"",null,"No",null,"","","","","","","","",null,null,0,{"$nulls":3},"No"]
[null,942,{"$nulls":5},{"$f":"IF(E961=\"\",\"\",VLOOKUP(E961,$AO$1114:$AP$1541,2,FALSE))","v":""},null,"",{"$nulls":4},"",null,"",null,"No",null,"","","","","","","",{"$f":"IF(AA961=\"\",\"\",IF(AND(R961=\"Interior\",S961=\"No\",OR(T961=\"\",T961=\"No\")),$J$1027,IF(AND(R961=\"Interior\",S961=\"Yes\"),$J$1028,IF(AND(R961=\"Exterior\",S961=\"Yes\"),$J$1029,IF(AND(R961=\"Exterior\",S961=\"No\",N961<>G961),\"DNQ\",\"See Lighting Catalog to determine Code\")))))","v":""},null,null,0,{"$nulls":3},"No"]
[null,943,{"$nulls":5},"",null,"",{"$nulls":4},"",null,"",null,"No",null,"","","","","","","","",null,null,0,{"$nulls":3},"No"]
[null,944,{"$nulls":5},"",null,"",{"$nulls":4},"",null,"",null,"No",null,"","","","","","","","",null,null,0,{"$nulls":3},"No"]
[null,945,{"$nulls":5},"",null,"",{"$nulls":4},"",null,"",null,"No",null,"","","","","","","","",null,null,0,{"$nulls":3},"No",{"$nulls":6},"","",null,""]
[null,946,{"$nulls":5},"",null,"",{"$nulls":4},"",null,"",null,"No",null,"","","","","","","","",null,null,0,{"$nulls":3},"No"]
[null,947,{"$nulls":5},"",null,"",{"$nulls":4},"",null,"",null,"No",null,"","","","","","","","",null,null,0,{"$nulls":3},"No"]
[null,948,{"$nulls":5},"",null,"",{"$nulls":4},"",null,"",null,"No",null,"","","","","","","","",null,null,0,{"$nulls":3},"No"]
[null,949,{"$nulls":5},"",null,"",{"$nulls":4},"",null,"",null,"No",null,"","","","","","","","",null,null,0,{"$nulls":3},"No"]
[null,950,{"$nulls":5},"",null,"",{"$nulls":4},"",null,"",null,"No",null,"","","","","","","","",null,null,0,{"$nulls":3},"No"]
[null,951,{"$nulls":5},"",null,"",{"$nulls":4},"",null,"",null,"No",null,"","","","","","","","",null,null,0,{"$nulls":3},"No"]
[null,952,{"$nulls":5},"",null,"",{"$nulls":4},"",null,"",null,"No",null,"","","","",{"$f":"IFERROR(IF(OR(I971>0,H971=\"Enter Watts\"),I971*G971,H971*G971)-IF(OR(P971>0,O971=\"Enter Watts\"),P971*N971,O971*N971),\"\")","v":""},"",{"$f":"IF(AND(V971=\"\",X971=\"\"),\"\",IF(OR(V971=\"\",X971=\"\"),0,V971-X971))","v":""},"",null,null,0,{"$nulls":3},"No"]
[null,953,{"$nulls":5},"",null,"",{"$nulls":4},"",null,"",null,"No",null,"","","","",{"$f":"IFERROR(IF(OR(I972>0,H972=\"Enter Watts\"),I972*G972,H972*G972)-IF(OR(P972>0,O972=\"Enter Watts\"),P972*N972,O972*N972),\"\")","v":""},"",{"$f":"IF(AND(V972=\"\",X972=\"\"),\"\",IF(OR(V972=\"\",X972=\"\"),0,V972-X972))","v":""},"",null,null,0,{"$nulls":3},"No"]
[null,954,{"$nulls":5},"",null,"",{"$nulls":4},"",null,"",null,"No",null,"","","","","","","","",null,null,0,{"$nulls":3},"No"]
[null,955,{"$nulls":5},"",null,"",{"$nulls":4},"",null,"",null,"No",null,"","","","","","","","",null,null,0,{"$nulls":3},"No"]
[null,956,{"$nulls":5},"",null,"",{"$nulls":4},"",null,"",null,"No",null,"","","","","","","","",null,null,0,{"$nulls":3},"No",{"$nulls":6},"","",null,""]
[null,957,{"$nulls":5},"",null,"",{"$nulls":4},"",null,"",null,"No",null,"","","","","","","","",null,null,0,{"$nulls":3},"No"]
[null,958,{"$nulls":5},"",null,"",{"$nulls":4},"",null,"",null,"No",null,"","","","","","","","",null,null,0,{"$nulls":3},"No"]
[null,959,{"$nulls":5},"",null,"",{"$nulls":4},"",null,"",null,"No",null,"","","","","","","","",null,null,0,{"$nulls":3},"No"]
[null,960,{"$nulls":5},"",null,"",{"$nulls":4},"",null,"",null,"No",null,"","","","","","","","",null,null,0,{"$nulls":3},"No"]
[null,961,{"$nulls":5},"",null,{"$f":"IF(AND(E980<>\"\",G980<>\"\",$E$8=\"Default Sector Hours\"),VLOOKUP(IF(R980=\"Exterior\",\"Exterior\",$E$7),$V$1036:$W$1041,2,FALSE),\"\")","v":""},{"$nulls":4},{"$f":"IF(L980=\"\",\"\",VLOOKUP(L980,$AO$1113:$AP$1541,2,FALSE))","v":""},null,"",null,"No",null,"",{"$f":"IFERROR(IF(E980=\"\",\"\",G980/1000*IF(OR(I980>0,H980=\"Enter Watts\"),I980,H980)*IF(R980=\"Exterior\",$W$1041*(1-$G$15),IF($E$8=\"Manual Input\",J980,VLOOKUP($E$7,$V$1036:$Y$1040,2,FALSE))*(1-$E$15)      )),\"0\")","v":""},"",{"$f":"IFERROR(IF(AND(L980=\"\", E980=\"\"),\"\",N980/1000*IF(OR(P980>0,O980=\"Enter Watts\"),P980,O980)*IF(R980=\"Exterior\",$W$1041,IF($E$8=\"Manual Input\",Q980,VLOOKUP($E$7,$V$1036:$Y$1040,2,FALSE)))*IF(S980=\"Yes\",IF(R980=\"Exterior\",1-$Y$1041,1-VLOOKUP($E$7,$V$1036:$Y$1040,4,FALSE)),1)),0)","v":""},"","","","",null,null,0,{"$nulls":3},"No"]
[null,962,{"$nulls":5},"",null,"",{"$nulls":4},"",null,"",null,"No",null,{"$f":"IF(R981=\"Interior\",IF(E981=\"\",\"\",IF(OR(I981>0,H981=\"Enter Watts\"),I981*G981/1000*(1-$E$15),H981*G981/1000*(1-$E$15))),IF(E981=\"\",\"\",0))","v":""},"",{"$f":"IF(R981=\"Interior\",IF(AND(L981=\"\", E981=\"\"),\"\",IF(OR(P981>0,O981=\"Enter Watts\", P981=\"\"),P981*N981*(1-$Z$1036)/1000,O981*N981*(1-$Z$1036)/1000)),IF(AND(E981=\"\",L981=\"\"),\"\",0))","v":""},"","",{"$f":"IF(AND(U981=\"\",W981=\"\"),\"\",IF(OR(U981=\"\",W981=\"\"),0,  IF($E$8=\"Manual Input\",$G$9,   VLOOKUP($E$7,$V$1036:$Y$1041,3,FALSE))     *(U981-W981)))","v":""},"","",null,null,{"$f":"AD981*N981","v":0},{"$nulls":3},{"$f":"IF(_xlfn.ISFORMULA(J981)=TRUE,\"No\",\"Yes\")","v":"No"},{"$nulls":6},"","",null,""]
[null,963,{"$nulls":5},"",null,"",{"$nulls":4},"",null,"",null,"No",null,"","","","","","","","",null,null,0,{"$nulls":3},"No"]
[null,964,{"$nulls":5},"",null,"",{"$nulls":4},"",null,"",null,"No",null,"","","","","","","","",null,null,0,{"$nulls":3},"No"]
[null,965,{"$nulls":5},"",null,"",{"$nulls":4},"",null,"",null,"No",null,"","","","","","","","",null,null,0,{"$nulls":3},"No"]
[null,966,{"$nulls":5},"",null,"",{"$nulls":4},"",null,"",null,"No",null,"","","","","","","","",null,null,0,{"$nulls":3},"No"]
[null,967,{"$nulls":5},"",null,"",{"$nulls":4},"",null,"",null,"No",null,"","","","","","","","",null,null,0,{"$nulls":3},"No"]
[null,968,{"$nulls":5},"",null,"",{"$nulls":4},"",null,"",null,"No",null,"","","","","","","","",null,null,0,{"$nulls":3},"No"]
[null,969,{"$nulls":5},"",null,"",{"$nulls":4},"",null,"",null,"No",null,"","","","","","","","",null,null,0,{"$nulls":3},"No",{"$nulls":6},"","",null,""]
[null,970,{"$nulls":5},"",null,"",{"$nulls":4},"",null,"",null,"No",null,"","","","","","","","",null,null,0,{"$nulls":3},"No"]
[null,971,{"$nulls":5},"",null,"",{"$nulls":4},"",null,"",null,"No",null,"","","","","","","","",null,null,0,{"$nulls":3},"No"]
[null,972,{"$nulls":5},"",null,"",{"$nulls":4},"",null,"",null,"No",null,"","","","","","","","",null,null,0,{"$nulls":3},"No"]
[null,973,{"$nulls":5},"",null,"",{"$nulls":4},"",null,"",null,"No",null,"","","","","","","","",null,null,0,{"$nulls":3},"No"]
[null,974,{"$nulls":5},"",null,"",{"$nulls":4},"",null,"",null,"No",null,"","","","","","","","",null,null,0,{"$nulls":3},"No"]
[null,975,{"$nulls":5},"",null,"",{"$nulls":4},"",null,"",null,"No",null,"","","","","","","","",null,null,0,{"$nulls":3},"No",{"$nulls":6},"","",null,""]
[null,976,{"$nulls":5},"",null,"",{"$nulls":4},"",null,"",null,"No",null,"","","","","","","","",null,null,0,{"$nulls":3},"No"]
[null,977,{"$nulls":5},"",null,"",{"$nulls":4},"",null,"",null,"No",null,"","","","","","","","",null,null,0,{"$nulls":3},"No"]
[null,978,{"$nulls":5},"",null,"",{"$nulls":4},"",null,"",null,"No",null,"","","","","","","","",null,null,0,{"$nulls":3},"No"]
[null,979,{"$nulls":5},"",null,"",{"$nulls":4},"",null,"",null,"No",null,"","","","","","","","",null,null,0,{"$nulls":3},"No"]
[null,980,{"$nulls":5},"",null,"",{"$nulls":4},"",null,"",null,"No",null,"","","","","","","","",null,null,0,{"$nulls":3},"No"]
[null,981,{"$nulls":5},"",null,"",{"$nulls":4},"",null,"",null,"No",null,"","","","","","","","",null,null,0,{"$nulls":3},"No"]
[null,982,{"$nulls":5},"",null,"",{"$nulls":4},"",null,"",null,"No",null,"","","","","","","","",null,null,0,{"$nulls":3},"No"]
[null,983,{"$nulls":5},"",null,"",{"$nulls":4},"",null,"",null,"No",null,"","","","","","","","",null,null,0,{"$nulls":3},"No"]
[null,984,{"$nulls":5},"",null,"",{"$nulls":4},"",null,"",null,"No",null,"","","","","","","","",null,null,0,{"$nulls":3},"No"]
[null,985,{"$nulls":5},"",null,"",{"$nulls":4},"",null,"",null,"No",null,"","","","","","","","",null,null,0,{"$nulls":3},"No"]
[null,986,{"$nulls":5},"",null,"",{"$nulls":4},"",null,"",null,"No",null,"","","","","","","","",null,null,0,{"$nulls":3},"No"]
[null,987,{"$nulls":5},"",null,"",{"$nulls":4},"",null,"",null,"No",null,"","","","","","","","",null,null,0,{"$nulls":3},"No",{"$nulls":6},"","",null,""]
[null,988,{"$nulls":5},"",null,"",{"$nulls":4},"",null,"",null,"No",null,"","","","","","","","",null,null,0,{"$nulls":3},"No"]
[null,989,{"$nulls":5},"",null,"",{"$nulls":4},"",null,"",null,"No",null,"","","","","","","","",null,null,0,{"$nulls":3},"No"]
[null,990,{"$nulls":5},"",null,"",{"$nulls":4},"",null,"",null,"No",null,"","","","","","","","",null,null,0,{"$nulls":3},"No"]
[null,991,{"$nulls":5},"",null,"",{"$nulls":4},"",null,"",null,"No",null,"","","","","","","","",null,null,0,{"$nulls":3},"No"]
[null,992,{"$nulls":5},"",null,"",{"$nulls":4},"",null,"",null,"No",null,"","","","","","","","",null,null,0,{"$nulls":3},"No"]
[null,993,{"$nulls":5},"",null,"",{"$nulls":4},"",null,"",null,"No",null,"","","","","","","","",null,null,0,{"$nulls":3},"No",{"$nulls":6},"","",null,""]
[null,994,{"$nulls":5},"",null,"",{"$nulls":4},"",null,"",null,"No",null,"","","","","","","","",null,null,0,{"$nulls":3},"No"]
[null,995,{"$nulls":5},"",null,"",{"$nulls":4},"",null,"",null,"No",null,"","","","","","","","",null,null,0,{"$nulls":3},"No"]
[null,996,{"$nulls":5},"",null,"",{"$nulls":4},"",null,"",null,"No",null,"","","","","","","","",null,null,0,{"$nulls":3},"No"]
[null,997,{"$nulls":5},"",null,"",{"$nulls":4},"",null,"",null,"No",null,"","","","","","","","",null,null,0,{"$nulls":3},"No"]
[null,998,{"$nulls":5},"",null,"",{"$nulls":4},"",null,"",null,"No",null,"","","","","","","","",null,null,0,{"$nulls":3},"No"]
[null,999,{"$nulls":5},"",null,"",{"$nulls":4},"",null,"",null,"No",null,"","","","","","","","",null,null,0,{"$nulls":3},"No"]
[null,1000,{"$nulls":5},"",null,"",{"$nulls":4},"",null,"",null,"No",null,"","","","","","","","",null,null,0,{"$nulls":3},"No"]
[{"$nulls":5},"Totals:",{"$f":"SUM(G20:G1019)","v":0},{"$nulls":6},{"$f":"SUM(N20:N1019)","v":0},{"$nulls":16},{"$f":"SUM(AE20:AE1019)","v":0}]
[]
[]
[]
[]
[null,null,"EUL Source:  Workpaper",{"$nulls":7},"Savings for Project by Measure ID "]
[null,null,"Measure Master ID","Measure Master Name",null,"Group / Measure Type","EUL",null,null,"MMID","Peak kW","Annual kWh","Lifecycle kWh","Annual Energy Cost Savings",null,"Incentive Rate",null,"Watts Reduced","Incentive by Code",null,null,"Cost Effectiveness ($/MMBtu)"]
[null,{"$f":"C1027&\" - \"&D1027","v":"L5029 - CLS - Fixture or Retrofit Kit Only"},"L5029","CLS - Fixture or Retrofit Kit Only",null,"Lighting / Custom",15,null,null,"L5029",{"$f":"ROUND(SUMIF($AB$20:$AB$1019,$J1027,$Z$20:$Z$1019),4)","v":{"v":0,"d":"0.0000"}},{"$f":"ROUND(SUMIF($AB$20:$AB$1019,$J1027,$AA$20:$AA$1019),0)","v":0},{"$f":"L1027*G1027","v":0},{"$f":"L1027*E$11","v":{"v":0,"d":"$0.00"}},null,{"v":0.25,"d":"$0.25"},null,{"$f":"IFERROR(ROUND(SUMIF($AB$20:$AB$1019,$J1027,$Y$20:$Y$1019),0),\"\")","v":0},{"$f":"IFERROR(R1027*P1027,\"\")","v":{"v":0,"d":"$0.00"}},null,null,{"$f":"IFERROR(S1027/(M1027*0.003412),0)","v":{"v":0,"d":"$0.00"}}]
[null,"L5031 - CLS - Fixture or Retrofit Kit/Lamp with Connected Controls, Interior","L5031","CLS - Fixture or Retrofit Kit/Lamp with Connected Controls, Interior",null,"Lighting / Custom",15,null,null,"L5031",{"$f":"ROUND(SUMIF($AB$20:$AB$1019,$J1028,$Z$20:$Z$1019),4)","v":{"v":0,"d":"0.0000"}},{"$f":"ROUND(SUMIF($AB$20:$AB$1019,$J1028,$AA$20:$AA$1019),0)","v":0},{"$f":"L1028*G1028","v":0},{"$f":"L1028*E$11","v":{"v":0,"d":"$0.00"}},null,{"v":0.45,"d":"$0.45"},null,{"$f":"IFERROR(ROUND(SUMIF($AB$20:$AB$1019,$J1028,$Y$20:$Y$1019),0),\"\")","v":0},{"$f":"IFERROR(R1028*P1028,\"\")","v":{"v":0,"d":"$0.00"}},null,null,{"$f":"IFERROR(S1028/(M1028*0.003412),0)","v":{"v":0,"d":"$0.00"}}]
[null,"L5030 - CLS - Fixture or Retrofit Kit/Lamp with Connected Controls, Exterior","L5030","CLS - Fixture or Retrofit Kit/Lamp with Connected Controls, Exterior",null,"Lighting / Custom",15,null,null,"L5030",{"$f":"ROUND(SUMIF($AB$20:$AB$1019,$J1029,$Z$20:$Z$1019),4)","v":{"v":0,"d":"0.0000"}},{"$f":"ROUND(SUMIF($AB$20:$AB$1019,$J1029,$AA$20:$AA$1019),0)","v":0},{"$f":"L1029*G1029","v":0},{"$f":"L1029*E12","v":{"v":0,"d":"$0.00"}},null,{"v":0.5,"d":"$0.50"},null,{"$f":"IFERROR(ROUND(SUMIF($AB$20:$AB$1019,$J1029,$Y$20:$Y$1019),0),\"\")","v":0},{"$f":"IFERROR(R1029*P1029,\"\")","v":{"v":0,"d":"$0.00"}},null,null,{"$f":"IFERROR(S1029/(M1029*0.003412),0)","v":{"v":0,"d":"$0.00"}}]
[{"$nulls":18},"Total Incentive"]
[{"$nulls":18},{"$f":"MIN(SUM(S1027:U1029))","v":{"v":0,"d":"$0.00"}}]
[{"$nulls":19},"Check Savings & Incentives tab for Incentive caps"]
[null,null,"Additional Notes / Supporting Docs",{"$nulls":24},"Source: IL TRM, V8.0, October 2019"]
[{"$nulls":21},"Default Sector Values",{"$nulls":5},"Volume 2: Commercial and Industrial Measures, Page 430."]
[{"$nulls":21},"Sector","HOU","CF","SF","SF ACTIVE",null,"Building/Space Type","Coincidence Factor"]
[{"$nulls":21},"Commercial",3730,0.77,0.56,{"$f":"VLOOKUP($E$7,V1036:Y1041,4,FALSE)","v":{"v":0.41,"d":"0.410"}},null,"_Sector Default_",{"$f":"VLOOKUP(E7,$V$1036:$Y$1041,3,FALSE)","v":0.64}]
[{"$nulls":21},"Industrial",4745,0.77,0.47,null,null,"Assisted Living",0.66]
[{"$nulls":21},"Multifamily",5950,0.77,0.49,null,null,"Auto Dealership",0.97]
[{"$nulls":21},"Schools & Gov",3239,0.64,0.41,null,null,"Childcare/Pre-School",0.72]
[{"$nulls":27},"College",0.63]
[{"$nulls":21},"Exterior",4380,0,0.5,null,null,"Convenience Store",0.76]
[{"$nulls":27},"Drug Store",{"v":1,"d":"1.00"}]
[{"$nulls":21},"Default Utility Rates",{"$nulls":5},"Elementary School",0.65]
[{"$nulls":21},"Sector","$/kWh",{"$nulls":4},"Grocery",0.82]
[{"$nulls":21},"Commercial/Schools & Government",{"$f":"'Savings and Incentives'!D52","v":{"v":0.1109,"d":"$0.1109"}},{"$nulls":4},"Healthcare Clinic",0.67]
[{"$nulls":21},"Industrial",{"$f":"'Savings and Incentives'!D53","v":{"v":0.0776,"d":"$0.0776"}},{"$nulls":4},"High School",0.65]
[{"$nulls":21},"Residential",{"$f":"'Savings and Incentives'!D54","v":{"v":0.1587,"d":"$0.1587"}},{"$nulls":4},"Hospital",0.56]
[{"$nulls":21},"EIA 2022 Annual Rates",{"$nulls":5},"Manufacturing Facility",0.81]
[{"$nulls":27},"Multifamily High Rise - Common Area",{"v":0.9,"d":"0.90"}]
[{"$nulls":27},"Multifamily Mid Rise - Common Area",0.62]
[{"$nulls":27},"Hotel/Motel - Guest Rooms",0.46,{"$nulls":10},"Version: 1.0"]
[{"$nulls":27},"Hotel/Motel - Common Area",0.85,{"$nulls":10},"Release Date: 4/4/2013"]
[{"$nulls":27},"Movie Theater",0.53,{"$nulls":10},"Notes:"]
[{"$nulls":27},"Office - High Rise",{"v":0.6,"d":"0.60"},{"$nulls":10},"*Compiled using values from the following sources 2010 Xcel Energy wattage guide,  2007 Centerpoint Energy Wattage Table, and various manufacturers literature. "]
[{"$nulls":27},"Office - Mid Rise",{"v":0.6,"d":"0.60"},{"$nulls":10},"*Unless denoted all wattage values shown for linear fluorescent products assume a normal ballast factor ballast "]
[{"$nulls":27},"Office - Low Rise",0.52,{"$nulls":10},"*HB = High Bay w/ a high ballast factor ballast"]
[{"$nulls":27},"Public Sector",0.65,{"$nulls":10},"*HO = High Output Lamps and Ballasts"]
[{"$nulls":27},"Religious Building",0.48,{"$nulls":10},"*VHO = Very High Output Lamps and Ballasts"]
[{"$nulls":27},"Restaurant",{"v":1,"d":"1.00"}]
[{"$nulls":27},"Retail - Department Store",0.94,{"$nulls":10},"Category (no Duplicates)","Named Range"]
[{"$nulls":27},"Retail - Strip Mall",0.71,{"$nulls":10},"**Removed**","RemovedNoReplacement"]
[{"$nulls":27},"Warehouse",0.85,{"$nulls":10},"Ceramic Metal Halide","CeramicMetalHalide"]
[{"$nulls":27},"Coincidence Factor = 0.10",{"v":0.1,"d":"0.10"},{"$nulls":10},"CMH and PSMH Lamps","CMHandPSMHLamps"]
[{"$nulls":27},"Coincidence Factor = 0.20",{"v":0.2,"d":"0.20"},{"$nulls":10},"CFL 2 Pin Based","CFL2PinBased"]
[{"$nulls":27},"Coincidence Factor = 0.30",{"v":0.3,"d":"0.30"},{"$nulls":10},"CFL 4 Pin Based","CFL4PinBased"]
[{"$nulls":27},"Coincidence Factor = 0.40",{"v":0.4,"d":"0.40"},{"$nulls":10},"CFL w/ Integral Ballast Screw or GU24","CFLWithIntegralBallastScrewOrGU24Based"]
[{"$nulls":27},"Coincidence Factor = 0.50",{"v":0.5,"d":"0.50"},{"$nulls":10},"Cold Cathode Screw Based Lamp","ColdCathodeFluorescentScrewBasedLamps"]
[{"$nulls":27},"Coincidence Factor = 0.60",{"v":0.6,"d":"0.60"},{"$nulls":10},"Exit Signs","ExitSigns"]
[{"$nulls":27},"Coincidence Factor = 0.70",{"v":0.7,"d":"0.70"},{"$nulls":10},"Fluorescent - T12 1.5ft","T12_1.5ft"]
[{"$nulls":27},"Coincidence Factor = 0.80",{"v":0.8,"d":"0.80"},{"$nulls":10},"Fluorescent - T12 2ft","T12_2ft"]
[{"$nulls":27},"Coincidence Factor = 0.90",{"v":0.9,"d":"0.90"},{"$nulls":10},"Fluorescent - T12 3ft","T12_3ft"]
[{"$nulls":27},"Coincidence Factor = 1.00",{"v":1,"d":"1.00"},{"$nulls":10},"Fluorescent - T12 4ft","T12_4ft"]
[{"$nulls":39},"Fluorescent - T12 5ft","T12_5ft"]
[{"$nulls":39},"Fluorescent - T12 6ft","T12_6ft"]
[{"$nulls":39},"Fluorescent - T12 8ft","T12_8ft"]
[{"$nulls":39},"Fluorescent - T12 U-tube","T12U_tube"]
[{"$nulls":39},"Fluorescent - T5 and T5HO 2ft","T5_2ft"]
[{"$nulls":39},"Fluorescent - T5 and T5HO 3ft","T5_3ft"]
[{"$nulls":39},"Fluorescent - T5 and T5HO 4ft","T5_4ft"]
[{"$nulls":39},"Fluorescent - T8 1.5ft","T8_1.5ft"]
[{"$nulls":39},"Fluorescent - T8 2ft","T8_2ft"]
[{"$nulls":39},"Fluorescent - T8 3ft","T8_3ft"]
[{"$nulls":39},"Fluorescent - T8 4ft","T8_4ft"]
[{"$nulls":39},"Fluorescent - T8 4ft (Std ballast, RW lamps)","T8_4ft_StdBallastRWlamp"]
[{"$nulls":39},"Fluorescent - HPT8 4ft","HPT8_4ft"]
[{"$nulls":39},"Fluorescent - RWT8 4ft","RWT8_4ft"]
[{"$nulls":39},"Fluorescent - T8 5ft","T8_5ft"]
[{"$nulls":39},"Fluorescent - T8 8ft","T8_8ft"]
[{"$nulls":39},"Fluorescent - T8 U-tube","T8U_tube"]
[{"$nulls":39},"Fluorescent - T8 4ft Lamp Only","T8_4ft_Lamp"]
[{"$nulls":39},"Fluorescent - T8 8ft Lamp Only","T8_8ft_Lamp"]
[{"$nulls":39},"High Pressure Sodium","HighPressureSodium"]
[{"$nulls":39},"Incandescent","Incandescent"]
[{"$nulls":39},"Induction","Induction"]
[{"$nulls":39},"LED (Other)","LED_Lighting"]
[{"$nulls":39},"LED (ENERGY STAR)","LED_EnergyStar"]
[{"$nulls":39},"LED (DLC Outdoor)","LED_DLC_Outdoor"]
[{"$nulls":39},"LED (DLC Indoor)","LED_DLC_Indoor"]
[{"$nulls":39},"LED (DLC Outdoor Retrofit Kit)","LED_DLC_OutdoorRetrofitKit"]
[{"$nulls":39},"LED (DLC Indoor Retrofit Kit)","LED_DLC_IndoorRetrofitKit"]
[{"$nulls":39},"LED (DLC Linear Replacement Lamp)","LED_DLC_LinearReplacementLamp"]
[{"$nulls":39},"LED (DLC Mogul Screw-Base HID Replacement)","LED_DLC_MogulScrewBaseHidReplacement"]
[{"$nulls":39},"Mercury Vapor","MercuryVapor"]
[{"$nulls":39},"Metal Halide","MetalHalide"]
[{"$nulls":39},"Pulse Start Metal Halide","PulseStartMetalHalide"]
[{"$nulls":39},"Neon","Neon"]
[{"$nulls":39},"Other Lamp or Fixture","OtherLampOrFixture"]
[]
[]
[{"$nulls":39},"Additions to the Focus Input Wattage Guide needed for this calc are highlighted in yellow."]
[]
[{"$nulls":39},"Category","Description","Default Wattage","Orig T12 Watts","T8 Equivalent Description"]
[{"$nulls":39},"**Removed**","Baseline Fixture Removed and Not Replaced",0]
[{"$nulls":39},"Ceramic Metal Halide","39 watt CMH",46]
[{"$nulls":39},"Ceramic Metal Halide","50 watt CMH",55]
[{"$nulls":39},"Ceramic Metal Halide","60 watt CMH",67]
[{"$nulls":39},"Ceramic Metal Halide","90 watt CMH",99]
[{"$nulls":39},"Ceramic Metal Halide","140 watt CMH",154]
[{"$nulls":39},"Ceramic Metal Halide","150 watt CMH",185]
[{"$nulls":39},"Ceramic Metal Halide","210 watt CMH",229]
[{"$nulls":39},"Ceramic Metal Halide","220 watt CMH",242]
[{"$nulls":39},"Ceramic Metal Halide","270 watt CMH",290]
[{"$nulls":39},"Ceramic Metal Halide"," 315 watt CMH",343]
[{"$nulls":39},"Ceramic Metal Halide","575 watt CMH",640]
[{"$nulls":39},"CMH and PSMH Lamps","145 watt CMH Lamp",174]
[{"$nulls":39},"CMH and PSMH Lamps","150 watt CMH Lamp",180]
[{"$nulls":39},"CMH and PSMH Lamps","205 watt CMH Lamp",235]
[{"$nulls":39},"CMH and PSMH Lamps","220 watt CMH Lamp",242]
[{"$nulls":39},"CMH and PSMH Lamps","260 watt CMH Lamp",299]
[{"$nulls":39},"CMH and PSMH Lamps","330 watt CMH and PSMH Lamps",380]
[{"$nulls":39},"CMH and PSMH Lamps","360 watt MH Lamp",414]
[{"$nulls":39},"CMH and PSMH Lamps","830 watt CMH Lamp",896]
[{"$nulls":39},"CFL 2 Pin Based","10W CFL 2-Pin Base",15]
[{"$nulls":39},"CFL 2 Pin Based","16W CFL 2-Pin Base",22]
[{"$nulls":39},"CFL 2 Pin Based","21W CFL 2-Pin Base",24]
[{"$nulls":39},"CFL 2 Pin Based","28W CFL 2-Pin Base",32]
[{"$nulls":39},"CFL 2 Pin Based","38W CFL 2-Pin Base",39]
[{"$nulls":39},"CFL 4 Pin Based","5W CFL 4-Pin Base",9]
[{"$nulls":39},"CFL 4 Pin Based","7W CFL 4-Pin Base",10]
[{"$nulls":39},"CFL 4 Pin Based","9W CFL 4-Pin Base",13]
[{"$nulls":39},"CFL 4 Pin Based","10W CFL 4-Pin Base",15]
[{"$nulls":39},"CFL 4 Pin Based","13W CFL 4-Pin Base",16]
[{"$nulls":39},"CFL 4 Pin Based","14W CFL 4-Pin Base",18]
[{"$nulls":39},"CFL 4 Pin Based","15W CFL 4-Pin Base",20]
[{"$nulls":39},"CFL 4 Pin Based","16W CFL 4-Pin Base",22]
[{"$nulls":39},"CFL 4 Pin Based","17W CFL 4-Pin Base",24]
[{"$nulls":39},"CFL 4 Pin Based","18W CFL 4-Pin Base",23]
[{"$nulls":39},"CFL 4 Pin Based","20W CFL 4-Pin Base",23]
[{"$nulls":39},"CFL 4 Pin Based","21W CFL 4-Pin Base",24]
[{"$nulls":39},"CFL 4 Pin Based","22W CFL 4-Pin Base",26]
[{"$nulls":39},"CFL 4 Pin Based","23W CFL 4-Pin Base",27]
[{"$nulls":39},"CFL 4 Pin Based","24W CFL 4-Pin Base",32]
[{"$nulls":39},"CFL 4 Pin Based","25W CFL 4-Pin Base",33]
[{"$nulls":39},"CFL 4 Pin Based","26W CFL 4-Pin Base",31]
[{"$nulls":39},"CFL 4 Pin Based","27W CFL 4-Pin Base",29]
[{"$nulls":39},"CFL 4 Pin Based","28W CFL 4-Pin Base",33]
[{"$nulls":39},"CFL 4 Pin Based","32W CFL 4-Pin Base",35]
[{"$nulls":39},"CFL 4 Pin Based","33W CFL 4-Pin Base",35]
[{"$nulls":39},"CFL 4 Pin Based","36W CFL 4-Pin Base",51]
[{"$nulls":39},"CFL 4 Pin Based","38W CFL 4-Pin Base",40]
[{"$nulls":39},"CFL 4 Pin Based","40W CFL 4-Pin Base",48]
[{"$nulls":39},"CFL 4 Pin Based","42W CFL 4-Pin Base",46]
[{"$nulls":39},"CFL 4 Pin Based","55W CFL 4-Pin Base",58]
[{"$nulls":39},"CFL 4 Pin Based","57W CFL 4-Pin Base",59]
[{"$nulls":39},"CFL 4 Pin Based","70W CFL 4-Pin Base",73]
[{"$nulls":39},"CFL 4 Pin Based","85W CFL 4-Pin Base",96]
[{"$nulls":39},"CFL 4 Pin Based","120W CFL 4-Pin Base",135]
[{"$nulls":39},"CFL w/ Integral Ballast Screw or GU24","2W CFL Lamp",2]
[{"$nulls":39},"CFL w/ Integral Ballast Screw or GU24","4W CFL Lamp",4]
[{"$nulls":39},"CFL w/ Integral Ballast Screw or GU24","7W CFL Lamp",7]
[{"$nulls":39},"CFL w/ Integral Ballast Screw or GU24","9W CFL Lamp",9]
[{"$nulls":39},"CFL w/ Integral Ballast Screw or GU24","11W CFL Lamp",11]
[{"$nulls":39},"CFL w/ Integral Ballast Screw or GU24","13W CFL Lamp",16,"updated to match 2020 Lighting catalog"]
[{"$nulls":39},"CFL w/ Integral Ballast Screw or GU24","14W CFL Lamp",14]
[{"$nulls":39},"CFL w/ Integral Ballast Screw or GU24","15W CFL Lamp",15]
[{"$nulls":39},"CFL w/ Integral Ballast Screw or GU24","16W CFL Lamp",16]
[{"$nulls":39},"CFL w/ Integral Ballast Screw or GU24","17W CFL Lamp",17]
[{"$nulls":39},"CFL w/ Integral Ballast Screw or GU24","18W CFL Lamp",23,"updated to match 2020 Lighting catalog"]
[{"$nulls":39},"CFL w/ Integral Ballast Screw or GU24","20W CFL Lamp",20]
[{"$nulls":39},"CFL w/ Integral Ballast Screw or GU24","23W CFL Lamp",23]
[{"$nulls":39},"CFL w/ Integral Ballast Screw or GU24","25W CFL Lamp",25]
[{"$nulls":39},"CFL w/ Integral Ballast Screw or GU24","26W CFL Lamp",31,"updated to match 2020 Lighting catalog"]
[{"$nulls":39},"CFL w/ Integral Ballast Screw or GU24","27W CFL Lamp",27]
[{"$nulls":39},"CFL w/ Integral Ballast Screw or GU24","28W CFL Lamp",28]
[{"$nulls":39},"CFL w/ Integral Ballast Screw or GU24","32W CFL Lamp",35,"updated to match 2020 Lighting catalog"]
[{"$nulls":39},"CFL w/ Integral Ballast Screw or GU24","42W CFL Lamp",46,"updated to match 2020 Lighting catalog"]
[{"$nulls":39},"CFL w/ Integral Ballast Screw or GU24","44W CFL Lamp",44]
[{"$nulls":39},"CFL w/ Integral Ballast Screw or GU24","50W CFL Lamp",59]
[{"$nulls":39},"CFL w/ Integral Ballast Screw or GU24","70W CFL Lamp",83]
[{"$nulls":39},"CFL w/ Integral Ballast Screw or GU24","75W CFL Lamp",89]
[{"$nulls":39},"CFL w/ Integral Ballast Screw or GU24","100W CFL Lamp",112]
[{"$nulls":39},"CFL w/ Integral Ballast Screw or GU24","150W CFL Lamp",150]
[{"$nulls":39},"CFL w/ Integral Ballast Screw or GU24","200W CFL Lamp",200]
[{"$nulls":39},"Cold Cathode Screw Based Lamp","3W Cold Cathode",3]
[{"$nulls":39},"Cold Cathode Screw Based Lamp","4W Cold Cathode",4]
[{"$nulls":39},"Cold Cathode Screw Based Lamp","5W Cold Cathode",5]
[{"$nulls":39},"Cold Cathode Screw Based Lamp","8W Cold Cathode",8]
[{"$nulls":39},"Exit Signs","5w CFL Exit Sign (X1)",9]
[{"$nulls":39},"Exit Signs","5w CFL Exit Sign (X2)",20]
[{"$nulls":39},"Exit Signs","6w CFL Exit Sign (X1)",13]
[{"$nulls":39},"Exit Signs","6w CFL Exit Sign (X2)",26]
[{"$nulls":39},"Exit Signs","7w CFL Exit Sign (X1)",10]
[{"$nulls":39},"Exit Signs","7w CFL Exit Sign (X2)",21]
[{"$nulls":39},"Exit Signs","8w CFL Exit Sign (X1)",12]
[{"$nulls":39},"Exit Signs","8w CFL Exit Sign (X2)",24]
[{"$nulls":39},"Exit Signs","9w CFL Exit Sign (X1)",12]
[{"$nulls":39},"Exit Signs","9w CFL Exit Sign (X2)",20]
[{"$nulls":39},"Exit Signs","2 Watt LED Exit Sign  (X1)",2]
[{"$nulls":39},"Exit Signs","2 Watt LED Exit Sign  (X2)",4]
[{"$nulls":39},"Exit Signs","3 Watt LED Exit Sign  (X1)",3,"Equiv T8 Watts","T8 Equivalent Description (Focus wattage guide unless otherwise noted)"]
[{"$nulls":39},"Fluorescent - T12 1.5ft","1L 15W T12",20,20,"1L 15W T8"]
[{"$nulls":39},"Fluorescent - T12 1.5ft","2L 15W T12",39,38,"2L 15W T8"]
[{"$nulls":39},"Fluorescent - T12 and T12HO 2ft","1L F20 T12 ",23,20,"1L F17 T8 "]
[{"$nulls":39},"Fluorescent - T12 and T12HO 2ft","2L F20 T12 ",52,36,"2L F17 T8 "]
[{"$nulls":39},"Fluorescent - T12 and T12HO 2ft","3L F20 T12 ",68,52,"3L F17 T8 "]
[{"$nulls":39},"Fluorescent - T12 and T12HO 2ft","4L F20 T12 ",96,66,"4L F17 T8 "]
[{"$nulls":39},"Fluorescent - T12 and T12HO 2ft","6L F20 T12 ",146,102,"6L F17 T8 (estimated as a 4L T8 and 2L T8)"]
[{"$nulls":39},"Fluorescent - T12 and T12HO 2ft","1L F24 T12/HO (35w Lamps)",63,63,"Using T12HO wattage as placeholder"]
[{"$nulls":39},"Fluorescent - T12 and T12HO 2ft","2L F24 T12/HO (35w Lamps)",92,92,"Using T12HO wattage as placeholder"]
[{"$nulls":39},"Fluorescent - T12 and T12HO 3ft","1L F30 T12 /ES",31,27,"1L F25 T8"]
[{"$nulls":39},"Fluorescent - T12 and T12HO 3ft","2L F30 T12/ES",64,50,"2L F25 T8"]
[{"$nulls":39},"Fluorescent - T12 and T12HO 3ft","3L F30 T12/ES",98,73,"3L F25 T8"]
[{"$nulls":39},"Fluorescent - T12 and T12HO 3ft","4L F30 T12/ES",132,96,"4L F25 T8"]
[{"$nulls":39},"Fluorescent - T12 and T12HO 3ft","6L F30 T12/ES",198,135,"6L F25 T8"]
[{"$nulls":39},"Fluorescent - T12 and T12HO 3ft","1L F30 T12",39,27,"1L F25 T8"]
[{"$nulls":39},"Fluorescent - T12 and T12HO 3ft","2L F30 T12",70,50,"2L F25 T8"]
[{"$nulls":39},"Fluorescent - T12 and T12HO 3ft","3L F30 T12",110,73,"3L F25 T8"]
[{"$nulls":39},"Fluorescent - T12 and T12HO 3ft","4L F30 T12",144,96,"4L F25 T8"]
[{"$nulls":39},"Fluorescent - T12 and T12HO 3ft","6L F30 T12",225,135,"6L F25 T8"]
[{"$nulls":39},"Fluorescent - T12 and T12HO 3ft","1L F30 T12/HO (50w Lamps)",71,71,"Using T12HO wattage as placeholder"]
[{"$nulls":39},"Fluorescent - T12 and T12HO 3ft","2L F30 T12/HO (50w Lamps)",112,112,"Using T12HO wattage as placeholder"]
[{"$nulls":39},"Fluorescent - T12 and T12HO 4ft","1L F34 T12",39,33,"1L F32 T8"]
[{"$nulls":39},"Fluorescent - T12 and T12HO 4ft","2L F34 T12",66,61,"2L F32 T8"]
[{"$nulls":39},"Fluorescent - T12 and T12HO 4ft","3L F34 T12",103,91,"3L F32 T8"]
[{"$nulls":39},"Fluorescent - T12 and T12HO 4ft","4L F34 T12",136,120,"4L F32 T8"]
[{"$nulls":39},"Fluorescent - T12 and T12HO 4ft","1L F40 T12",39,33,"1L F32 T8"]
[{"$nulls":39},"Fluorescent - T12 and T12HO 4ft","2L F40 T12",79,61,"2L F32 T8"]
[{"$nulls":39},"Fluorescent - T12 and T12HO 4ft","3L F40 T12",124,91,"3L F32 T8"]
[{"$nulls":39},"Fluorescent - T12 and T12HO 4ft","4L F40 T12",153,120,"4L F32 T8"]
[{"$nulls":39},"Fluorescent - T12 and T12HO 4ft","6L F40 T12",186,174,"FLT8-32W x 6L x 4'-2 IS N from 2013 CenterPoint Energy Wattage Guide"]
[{"$nulls":39},"Fluorescent - T12 and T12HO 4ft","1L F40 T12/HO (60 watt Lamps)",76,76,"Using T12HO wattage as placeholder"]
[{"$nulls":39},"Fluorescent - T12 and T12HO 4ft","2L F40 T12/HO (60 watt Lamps)",134,134,"Using T12HO wattage as placeholder"]
[{"$nulls":39},"Fluorescent - T12 and T12HO 4ft","3L F40 T12/HO (60 watt Lamps)",217,217,"Using T12HO wattage as placeholder"]
[{"$nulls":39},"Fluorescent - T12 and T12HO 4ft","4L F40 T12/HO (60 watt Lamps)",276,276,"Using T12HO wattage as placeholder"]
[{"$nulls":39},"Fluorescent - T12 and T12HO 4ft","1L F40 T12/VHO (116w Lamps)",140,140,"Using T12HO wattage as placeholder"]
[{"$nulls":39},"Fluorescent - T12 and T12HO 4ft","2L F40 T12/VHO (116w Lamps)",252,252,"Using T12HO wattage as placeholder"]
[{"$nulls":39},"Fluorescent - T12 and T12HO 4ft","3L F40 T12/VHO (116w Lamps)",377,377,"Using T12HO wattage as placeholder"]
[{"$nulls":39},"Fluorescent - T12 and T12HO 4ft","4L F40 T12/VHO (116w Lamps)",484,484,"Using T12HO wattage as placeholder"]
[{"$nulls":39},"Fluorescent - T12 5ft","1L F60 T12 (50w Lamp)",54,36,"1L F40 T8"]
[{"$nulls":39},"Fluorescent - T12 5ft","2L F60 T12 (50w Lamp)",108,72,"2L F40 T8"]
[{"$nulls":39},"Fluorescent - T12 6ft","1L F72 T12 (57w Lamps)",73,51,"Xcel Energy wattage guide, avg. of 1L T8 6' mag and elec ballast"]
[{"$nulls":39},"Fluorescent - T12 6ft","2L F72 T12 (57w Lamps)",114,93,"Xcel Energy wattage guide, avg. of 2L T8 6' mag and elec ballast"]
[{"$nulls":39},"Fluorescent - T12 6ft","3L F72 T12 (57w Lamps)",189,144,"No data available, so used 1L + 2L 6' T8"]
[{"$nulls":39},"Fluorescent - T12 6ft","4L F72 T12 (57w Lamps)",230,185,"No data available, so used 2L + 2L 6' T8"]
[{"$nulls":39},"Fluorescent - T12 and T12HO 8ft","1L F96T12 (60w Lamps)",69,61,"1L F96T8 (59w Lamps)"]
[{"$nulls":39},"Fluorescent - T12 and T12HO 8ft","2L F96T12 (60w Lamps)",109,107,"2L F96T8 (59w Lamps)"]
[{"$nulls":39},"Fluorescent - T12 and T12HO 8ft","3L F96T12 (60w Lamps)",179,167,"3L F96T8 (59w Lamps)"]
[{"$nulls":39},"Fluorescent - T12 and T12HO 8ft","4L F96T12 (60w Lamps)",233,219,"4L F96T8 (59w Lamps)"]
[{"$nulls":39},"Fluorescent - T12 and T12HO 8ft","1L F96T12/HO (95w Lamps)",115,115,"Using T12HO wattage as placeholder"]
[{"$nulls":39},"Fluorescent - T12 and T12HO 8ft","2L F96T12/HO (95w Lamps)",190,190,"Using T12HO wattage as placeholder"]
[{"$nulls":39},"Fluorescent - T12 and T12HO 8ft","3L F96T12/HO (95w Lamps)",319,319,"Using T12HO wattage as placeholder"]
[{"$nulls":39},"Fluorescent - T12 and T12HO 8ft","4L F96T12/HO (95w Lamps)",414,414,"Using T12HO wattage as placeholder"]
[{"$nulls":39},"Fluorescent - T12 and T12HO 8ft","1L F96T12/VHO (185w Lamps)",202,202,"Using T12HO wattage as placeholder"]
[{"$nulls":39},"Fluorescent - T12 and T12HO 8ft","2L F96T12/VHO (185w Lamps)",389,389,"Using T12HO wattage as placeholder"]
[{"$nulls":39},"Fluorescent - T12 and T12HO 8ft","3L F96T12/VHO (185w Lamps)",568,568,"Using T12HO wattage as placeholder"]
[{"$nulls":39},"Fluorescent - T12 and T12HO 8ft","4L F96T12/VHO (185w Lamps)",760,760,"Using T12HO wattage as placeholder"]
[{"$nulls":39},"Fluorescent - T12 U-tube","1L FU40T12",43,29,"1L FU32T8"]
[{"$nulls":39},"Fluorescent - T12 U-tube","2L FU40T12",72,55,"2L FU32T8"]
[{"$nulls":39},"Fluorescent - T12 U-tube","3L FU40T12",115,81,"3L FU32T8"]
[{"$nulls":39},"Fluorescent - T5 and T5HO 2ft","1L F14T5",16]
[{"$nulls":39},"Fluorescent - T5 and T5HO 2ft","2L F14T5",31]
[{"$nulls":39},"Fluorescent - T5 and T5HO 2ft","3L F14T5",51]
[{"$nulls":39},"Fluorescent - T5 and T5HO 2ft","4L F14T5",66]
[{"$nulls":39},"Fluorescent - T5 and T5HO 2ft","1L F24T5/HO ",27]
[{"$nulls":39},"Fluorescent - T5 and T5HO 2ft","2L F24T5/HO ",53]
[{"$nulls":39},"Fluorescent - T5 and T5HO 2ft","3L F24T5/HO ",80]
[{"$nulls":39},"Fluorescent - T5 and T5HO 2ft","4L F24T5/HO ",105]
[{"$nulls":39},"Fluorescent - T5 and T5HO 2ft","6L F24T5/HO ",160]
[{"$nulls":39},"Fluorescent - T5 and T5HO 3ft","1L F21T5",25]
[{"$nulls":39},"Fluorescent - T5 and T5HO 3ft","2L F21T5",48]
[{"$nulls":39},"Fluorescent - T5 and T5HO 3ft","3L F21T5",73]
[{"$nulls":39},"Fluorescent - T5 and T5HO 3ft","4L F21T5",96]
[{"$nulls":39},"Fluorescent - T5 and T5HO 3ft","1L F39T5/HO",43]
[{"$nulls":39},"Fluorescent - T5 and T5HO 3ft","2L F39T5/HO",86]
[{"$nulls":39},"Fluorescent - T5 and T5HO 3ft","3L F39T5/HO",130]
[{"$nulls":39},"Fluorescent - T5 and T5HO 3ft","4L F39T5/HO",172]
[{"$nulls":39},"Fluorescent - T5 and T5HO 4ft","1L F28 T5",33]
[{"$nulls":39},"Fluorescent - T5 and T5HO 4ft","2L F28 T5",63]
[{"$nulls":39},"Fluorescent - T5 and T5HO 4ft","3L F28 T5",96]
[{"$nulls":39},"Fluorescent - T5 and T5HO 4ft","4L F28 T5",126]
[{"$nulls":39},"Fluorescent - T5 and T5HO 4ft","1L F54 T5HO",62]
[{"$nulls":39},"Fluorescent - T5 and T5HO 4ft","2L F54 T5HO",117]
[{"$nulls":39},"Fluorescent - T5 and T5HO 4ft","3L F54 T5HO",179]
[{"$nulls":39},"Fluorescent - T5 and T5HO 4ft","4L F54 T5HO HB",234]
[{"$nulls":39},"Fluorescent - T5 and T5HO 4ft","6L F54 T5HO HB",355]
[{"$nulls":39},"Fluorescent - T5 and T5HO 4ft","8L F54 T5HO HB",468]
[{"$nulls":39},"Fluorescent - T5 and T5HO 4ft","10L F54 T5HO HB",585]
[{"$nulls":39},"Fluorescent - T5 and T5HO 4ft","26 watt T5 Lamp",26]
[{"$nulls":39},"Fluorescent - T5 and T5HO 4ft","28 watt T5 Lamp",28]
[{"$nulls":39},"Fluorescent - T5 and T5HO 4ft","44 watt T5HO Lamp",44]
[{"$nulls":39},"Fluorescent - T5 and T5HO 4ft","47 watt T5HO Lamp",47]
[{"$nulls":39},"Fluorescent - T5 and T5HO 4ft","49 watt T5HO Lamp",49]
[{"$nulls":39},"Fluorescent - T5 and T5HO 4ft","51 watt T5HO Lamp",51]
[{"$nulls":39},"Fluorescent - T5 and T5HO 4ft","54 watt T5HO Lamp",54]
[{"$nulls":39},"Fluorescent - T8 1.5ft","1L 15W T8",20]
[{"$nulls":39},"Fluorescent - T8 1.5ft","2L 15W T8",38]
[{"$nulls":39},"Fluorescent - T8 2ft","1L F17 T8 ",20]
[{"$nulls":39},"Fluorescent - T8 2ft","2L F17 T8 ",36]
[{"$nulls":39},"Fluorescent - T8 2ft","3L F17 T8 ",52]
[{"$nulls":39},"Fluorescent - T8 2ft","4L F17 T8 ",66]
[{"$nulls":39},"Fluorescent - T8 3ft","1L F25 T8 3 ft",27]
[{"$nulls":39},"Fluorescent - T8 3ft","2L F25 T8 3 ft",50]
[{"$nulls":39},"Fluorescent - T8 3ft","3L F25 T8 3 ft",73]
[{"$nulls":39},"Fluorescent - T8 3ft","4L F25 T8 3 ft",96]
[{"$nulls":39},"Fluorescent - T8 3ft","6L F25 T8 3 ft",135]
[{"$nulls":39},"Fluorescent - T8 4ft","1L F32 T8 Low BF",26]
[{"$nulls":39},"Fluorescent - T8 4ft","2L F32 T8 Low BF",52]
[{"$nulls":39},"Fluorescent - T8 4ft","3L F32 T8 Low BF",78]
[{"$nulls":39},"Fluorescent - T8 4ft","4L F32 T8 Low BF",104]
[{"$nulls":39},"Fluorescent - T8 4ft","1L F32 T8 Normal BF",33]
[{"$nulls":39},"Fluorescent - T8 4ft","2L F32 T8 Normal BF",61]
[{"$nulls":39},"Fluorescent - T8 4ft","3L F32 T8 Normal BF",91]
[{"$nulls":39},"Fluorescent - T8 4ft","4L F32 T8 Normal BF",120]
[{"$nulls":39},"Fluorescent - T8 4ft","1L F32 T8 High BF",39]
[{"$nulls":39},"Fluorescent - T8 4ft","2L F32 T8 High BF",77]
[{"$nulls":39},"Fluorescent - T8 4ft","3L F32 T8 High BF",115]
[{"$nulls":39},"Fluorescent - T8 4ft","4L F32 T8 High BF",151]
[{"$nulls":39},"Fluorescent - T8 4ft","4L F32 T8 HB",151]
[{"$nulls":39},"Fluorescent - T8 4ft","6L F32 T8 HB",224]
[{"$nulls":39},"Fluorescent - T8 4ft","8L F32 T8 HB",291]
[{"$nulls":39},"Fluorescent - T8 4ft","10L F32 T8 HB",368]
[{"$nulls":39},"Fluorescent - T8 4ft (Std ballast, RW lamps)","1L F25 T8",25]
[{"$nulls":39},"Fluorescent - T8 4ft (Std ballast, RW lamps)","2L F25 T8",45]
[{"$nulls":39},"Fluorescent - T8 4ft (Std ballast, RW lamps)","3L F25 T8",65]
[{"$nulls":39},"Fluorescent - T8 4ft (Std ballast, RW lamps)","4L F25 T8",86]
[{"$nulls":39},"Fluorescent - T8 4ft (Std ballast, RW lamps)","4L F25 T8 HB",123]
[{"$nulls":39},"Fluorescent - T8 4ft (Std ballast, RW lamps)","1L F28 T8",26]
[{"$nulls":39},"Fluorescent - T8 4ft (Std ballast, RW lamps)","2L F28 T8",50]
[{"$nulls":39},"Fluorescent - T8 4ft (Std ballast, RW lamps)","3L F28 T8",74]
[{"$nulls":39},"Fluorescent - T8 4ft (Std ballast, RW lamps)","4L F28 T8",98]
[{"$nulls":39},"Fluorescent - T8 4ft (Std ballast, RW lamps)","4L F28 T8 HB",130]
[{"$nulls":39},"Fluorescent - T8 4ft (Std ballast, RW lamps)","6L F28 T8 HB",194]
[{"$nulls":39},"Fluorescent - T8 4ft (Std ballast, RW lamps)","1L F30 T8",30]
[{"$nulls":39},"Fluorescent - T8 4ft (Std ballast, RW lamps)","2L F30 T8",64]
[{"$nulls":39},"Fluorescent - T8 4ft (Std ballast, RW lamps)","3L F30 T8",79]
[{"$nulls":39},"Fluorescent - T8 4ft (Std ballast, RW lamps)","4L F30 T8",105]
[{"$nulls":39},"Fluorescent - CEE HPT8 4ft","1L F32 HPT8 (Low)",27]
[{"$nulls":39},"Fluorescent - CEE HPT8 4ft","2L F32 HPT8 (Low)",48]
[{"$nulls":39},"Fluorescent - CEE HPT8 4ft","3L F32 HPT8 (Low)",72]
[{"$nulls":39},"Fluorescent - CEE HPT8 4ft","4L F32 HPT8 (Low)",95]
[{"$nulls":39},"Fluorescent - CEE HPT8 4ft","1L F32 HPT8 (Normal)",28]
[{"$nulls":39},"Fluorescent - CEE HPT8 4ft","2L F32 HPT8 (Normal)",55]
[{"$nulls":39},"Fluorescent - CEE HPT8 4ft","3L F32 HPT8 (Normal)",82]
[{"$nulls":39},"Fluorescent - CEE HPT8 4ft","4L F32 HPT8 (Normal)",108]
[{"$nulls":39},"Fluorescent - CEE HPT8 4ft","1L F32 HPT8 (High)",37]
[{"$nulls":39},"Fluorescent - CEE HPT8 4ft","2L F32 HPT8 (High)",74]
[{"$nulls":39},"Fluorescent - CEE HPT8 4ft","3L F32 HPT8 (High)",109]
[{"$nulls":39},"Fluorescent - CEE HPT8 4ft","4L F32 HPT8 (High)",145]
[{"$nulls":39},"Fluorescent - CEE RWT8 4ft","1L F32 RWT8 (Low) (28w Lamps)",22]
[{"$nulls":39},"Fluorescent - CEE RWT8 4ft","2L F32 RWT8 (Low) (28w Lamps)",43]
[{"$nulls":39},"Fluorescent - CEE RWT8 4ft","3L F32 RWT8 (Low) (28w Lamps)",63]
[{"$nulls":39},"Fluorescent - CEE RWT8 4ft","4L F32 RWT8 (Low) (28w Lamps)",83]
[{"$nulls":39},"Fluorescent - CEE RWT8 4ft","1L F32 RWT8 (Normal) (28w Lamps)",25]
[{"$nulls":39},"Fluorescent - CEE RWT8 4ft","2L F32 RWT8 (Normal) (28w Lamps)",48]
[{"$nulls":39},"Fluorescent - CEE RWT8 4ft","3L F32 RWT8 (Normal) (28w Lamps)",72]
[{"$nulls":39},"Fluorescent - CEE RWT8 4ft","4L F32 RWT8 (Normal) (28w Lamps)",94]
[{"$nulls":39},"Fluorescent - CEE RWT8 4ft","1L F32 RWT8 (High) (28w Lamps)",33]
[{"$nulls":39},"Fluorescent - CEE RWT8 4ft","2L F32 RWT8 (High) (28w Lamps)",65]
[{"$nulls":39},"Fluorescent - CEE RWT8 4ft","3L F32 RWT8 (High) (28w Lamps)",96]
[{"$nulls":39},"Fluorescent - CEE RWT8 4ft","4L F32 RWT8 (High) (28w Lamps)",131]
[{"$nulls":39},"Fluorescent - CEE RWT8 4ft","1L F32 RWT8 (Low) (25w Lamps)",21]
[{"$nulls":39},"Fluorescent - CEE RWT8 4ft","2L F32 RWT8 (Low) (25w Lamps)",38]
[{"$nulls":39},"Fluorescent - CEE RWT8 4ft","3L F32 RWT8 (Low) (25w Lamps)",57]
[{"$nulls":39},"Fluorescent - CEE RWT8 4ft","4L F32 RWT8 (Low) (25w Lamps)",75]
[{"$nulls":39},"Fluorescent - CEE RWT8 4ft","1L F32 RWT8 (Normal) (25w Lamps)",23]
[{"$nulls":39},"Fluorescent - CEE RWT8 4ft","2L F32 RWT8 (Normal) (25w Lamps)",43]
[{"$nulls":39},"Fluorescent - CEE RWT8 4ft","3L F32 RWT8 (Normal) (25w Lamps)",64]
[{"$nulls":39},"Fluorescent - CEE RWT8 4ft","4L F32 RWT8 (Normal) (25w Lamps)",85]
[{"$nulls":39},"Fluorescent - CEE RWT8 4ft","1L F32 RWT8 (High) (25w Lamps)",31]
[{"$nulls":39},"Fluorescent - CEE RWT8 4ft","2L F32 RWT8 (High) (25w Lamps)",60]
[{"$nulls":39},"Fluorescent - CEE RWT8 4ft","3L F32 RWT8 (High) (25w Lamps)",93]
[{"$nulls":39},"Fluorescent - CEE RWT8 4ft","4L F32 RWT8 (High) (25w Lamps)",122]
[{"$nulls":39},"Fluorescent - T8 5ft","1L F40 T8",36]
[{"$nulls":39},"Fluorescent - T8 5ft","2L F40 T8",72]
[{"$nulls":39},"Fluorescent - T8 5ft","3L F40 T8",106]
[{"$nulls":39},"Fluorescent - T8 5ft","4L F40 T8",134]
[{"$nulls":39},"Fluorescent - T8 8ft","1L F96T8 (57watt Lamps)",51]
[{"$nulls":39},"Fluorescent - T8 8ft","1L F96T8 (59watt Lamps)",61]
[{"$nulls":39},"Fluorescent - T8 8ft","2L F96T8 (57watt Lamps)",100]
[{"$nulls":39},"Fluorescent - T8 8ft","2L F96T8 (59watt Lamps)",107]
[{"$nulls":39},"Fluorescent - T8 8ft","3L F96T8 (59watt Lamps)",167]
[{"$nulls":39},"Fluorescent - T8 8ft","4L F96T8 (59watt Lamps)",219]
[{"$nulls":39},"Fluorescent - T8 U-tube","1L FU32T8/6",29]
[{"$nulls":39},"Fluorescent - T8 U-tube","2L FU32T8/6",55]
[{"$nulls":39},"Fluorescent - T8 U-tube","3L FU32T8/6",81]
[{"$nulls":39},"Fluorescent - T8 4ft Lamp Only","25 watt Lamp",22]
[{"$nulls":39},"Fluorescent - T8 4ft Lamp Only","28 watt Lamp",25]
[{"$nulls":39},"Fluorescent - T8 4ft Lamp Only","30 watt Lamp",26]
[{"$nulls":39},"Fluorescent - T8 4ft Lamp Only","32 watt Lamp",28]
[{"$nulls":39},"Fluorescent - T8 8ft Lamp Only","49 watt Lamp",43]
[{"$nulls":39},"Fluorescent - T8 8ft Lamp Only","50 watt Lamp",44]
[{"$nulls":39},"Fluorescent - T8 8ft Lamp Only","51 watt Lamp",45]
[{"$nulls":39},"Fluorescent - T8 8ft Lamp Only","54 watt Lamp",48]
[{"$nulls":39},"Fluorescent - T8 8ft Lamp Only","59 watt Lamp",52]
[{"$nulls":39},"High Pressure Sodium","35 watt HPS",45]
[{"$nulls":39},"High Pressure Sodium","50 watt HPS",65]
[{"$nulls":39},"High Pressure Sodium","70 watt HPS",94,"updated to match 2020 Lighting catalog"]
[{"$nulls":39},"High Pressure Sodium","100 watt HPS",126,"updated to match 2020 Lighting catalog"]
[{"$nulls":39},"High Pressure Sodium","150 watt HPS",179,"updated to match 2020 Lighting catalog"]
[{"$nulls":39},"High Pressure Sodium","200 watt HPS",245]
[{"$nulls":39},"High Pressure Sodium","250 watt HPS",293,"updated to match 2020 Lighting catalog"]
[{"$nulls":39},"High Pressure Sodium","310 watt HPS",365]
[{"$nulls":39},"High Pressure Sodium","360 watt HPS",414]
[{"$nulls":39},"High Pressure Sodium","400 watt HPS",455,"updated to match 2020 Lighting catalog"]
[{"$nulls":39},"High Pressure Sodium","600 watt HPS",665]
[{"$nulls":39},"High Pressure Sodium","750 watt HPS",840]
[{"$nulls":39},"High Pressure Sodium","1000 watt HPS",1079,"updated to match 2020 Lighting catalog"]
[{"$nulls":39},"Incandescent","15W Incandescent",15]
[{"$nulls":39},"Incandescent","25W Incandescent",25]
[{"$nulls":39},"Incandescent","40W Incandescent",40]
[{"$nulls":39},"Incandescent","55W Incandescent",55]
[{"$nulls":39},"Incandescent","60W Incandescent",60]
[{"$nulls":39},"Incandescent","65W Incandescent",65]
[{"$nulls":39},"Incandescent","75W Incandescent",75]
[{"$nulls":39},"Incandescent","100W Incandescent",100]
[{"$nulls":39},"Incandescent","150W Incandescent",150]
[{"$nulls":39},"Incandescent","Other Incandescent","Enter Watts"]
[{"$nulls":39},"Induction","35 watt Induction Fixture",39]
[{"$nulls":39},"Induction","55 watt Induction Fixture",58]
[{"$nulls":39},"Induction","70 watt Induction Fixture",77]
[{"$nulls":39},"Induction","85 watt Induction Fixture",90]
[{"$nulls":39},"Induction","100 watt Induction Fixture",107]
[{"$nulls":39},"Induction","120 watt Induction Fixture",132]
[{"$nulls":39},"Induction","125 watt Induction Fixture",138]
[{"$nulls":39},"Induction","150 watt Induction Fixture",161]
[{"$nulls":39},"Induction","165 watt Induction Fixture",174]
[{"$nulls":39},"Induction","200 watt Induction Fixture",220]
[{"$nulls":39},"Induction","225 watt Induction Fixture",248]
[{"$nulls":39},"Induction","250 watt Induction Fixture",275]
[{"$nulls":39},"Induction","300 watt lnduction Fixture",330]
[{"$nulls":39},"Induction","750 watt lnduction Fixture",825]
[{"$nulls":39},"LED (Other)","LED (Other)","Enter Watts"]
[{"$nulls":39},"LED (ENERGY STAR)","LED (ENERGY STAR Lamps)","Enter Watts"]
[{"$nulls":39},"LED (ENERGY STAR)","LED (ENERGY STAR Fixtures)","Enter Watts"]
[{"$nulls":39},"LED (DLC Outdoor)","LED (DLC Outdoor Pole/Arm-mounted Area & Roadway Luminaires)","Enter Watts"]
[{"$nulls":39},"LED (DLC Outdoor)","LED (DLC Outdoor Pole/Arm-mounted Decorative Luminaires)","Enter Watts"]
[{"$nulls":39},"LED (DLC Outdoor)","LED (DLC Outdoor Full-Cutoff Wall-mounted Area Luminaires)","Enter Watts"]
[{"$nulls":39},"LED (DLC Outdoor)","LED (DLC Outdoor Non-Cutoff & Semi-Cutoff Wall-mounted Area Luminaires)","Enter Watts"]
[{"$nulls":39},"LED (DLC Outdoor)","LED (DLC Bollards)","Enter Watts"]
[{"$nulls":39},"LED (DLC Outdoor)","LED (DLC Parking Garage Luminaires)","Enter Watts"]
[{"$nulls":39},"LED (DLC Outdoor)","LED (DLC Fuel Pump Canopy Luminaires)","Enter Watts"]
[{"$nulls":39},"LED (DLC Outdoor)","LED (DLC L&scape/Accent Flood & Spot Luminaires)","Enter Watts"]
[{"$nulls":39},"LED (DLC Outdoor)","LED (DLC Architectural Flood & Spot Luminaires)","Enter Watts"]
[{"$nulls":39},"LED (DLC Outdoor)","LED (DLC Stairwell & Passageway Luminaires)","Enter Watts"]
[{"$nulls":39},"LED (DLC Indoor)","LED (DLC Wall-wash Luminaires)","Enter Watts"]
[{"$nulls":39},"LED (DLC Indoor)","LED (DLC Track or Mono-point Directional Luminaires)","Enter Watts"]
[{"$nulls":39},"LED (DLC Indoor)","LED (DLC Vertical Refrigerated Case Luminaires-center)","Enter Watts"]
[{"$nulls":39},"LED (DLC Indoor)","LED (DLC Vertical Refrigerated Case Luminaires-end)","Enter Watts"]
[{"$nulls":39},"LED (DLC Indoor)","LED (DLC Horizontal Refrigerated Case Luminaires)","Enter Watts"]
[{"$nulls":39},"LED (DLC Indoor)","LED (DLC Display Case Luminaires)","Enter Watts"]
[{"$nulls":39},"LED (DLC Indoor)","LED (DLC 2x2 Luminaires-Ambient Lighting of Interior Comm. Spaces)","Enter Watts"]
[{"$nulls":39},"LED (DLC Indoor)","LED (DLC 1x4 Luminaires-Ambient Lighting of Interior Comm. Spaces)","Enter Watts"]
[{"$nulls":39},"LED (DLC Indoor)","LED (DLC 2x4 Luminaires-Ambient Lighting of Interior Comm. Spaces)","Enter Watts"]
[{"$nulls":39},"LED (DLC Indoor)","LED (DLC Linear Ambient Luminaires w/ Indirect Component)","Enter Watts"]
[{"$nulls":39},"LED (DLC Indoor)","LED (DLC Direct Linear Ambient Luminaires)","Enter Watts"]
[{"$nulls":39},"LED (DLC Indoor)","LED (DLC High-bay Luminaires for C&I Buildings)","Enter Watts"]
[{"$nulls":39},"LED (DLC Indoor)","LED (DLC Low-bay Luminaires for C&I Buildings)","Enter Watts"]
[{"$nulls":39},"LED (DLC Indoor)","LED (DLC High-bay Aisle Luminaires)","Enter Watts"]
[{"$nulls":39},"LED (DLC Outdoor Retrofit Kit)","LED (DLC Retrofit Kits-Outdoor Pole/Arm-mounted Area & Roadway Luminaires)","Enter Watts"]
[{"$nulls":39},"LED (DLC Outdoor Retrofit Kit)","LED (DLC Retrofit Kits-Outdoor Pole/Arm-mounted Decorative Luminaires)","Enter Watts"]
[{"$nulls":39},"LED (DLC Outdoor Retrofit Kit)","LED (DLC Retrofit Kits-Large Outdoor Pole/Arm-mounted Area & Roadway Luminaires)","Enter Watts"]
[{"$nulls":39},"LED (DLC Outdoor Retrofit Kit)","LED (DLC Retrofit Kits-Full-Cutoff Outdoor Wall-mounted Area Luminaires)","Enter Watts"]
[{"$nulls":39},"LED (DLC Outdoor Retrofit Kit)","LED (DLC Retrofit Kits-Parking Garage Luminaires)","Enter Watts"]
[{"$nulls":39},"LED (DLC Outdoor Retrofit Kit)","LED (DLC Retrofit Kits-Fuel Pump Canopy Luminaires)","Enter Watts"]
[{"$nulls":39},"LED (DLC Indoor Retrofit Kit)","LED (DLC Retrofit Kits-2x2 Luminaires-Ambient Lighting of Interior Comm. Spaces )","Enter Watts"]
[{"$nulls":39},"LED (DLC Indoor Retrofit Kit)","LED (DLC Retrofit Kits-1x4 Luminaires-Ambient Lighting of Interior Comm. Spaces )","Enter Watts"]
[{"$nulls":39},"LED (DLC Indoor Retrofit Kit)","LED (DLC Retrofit Kits-2x4 Luminaires-Ambient Lighting of Interior Comm. Spaces )","Enter Watts"]
[{"$nulls":39},"LED (DLC Indoor Retrofit Kit)","LED (DLC Retrofit Kits-Direct Linear Ambient Luminaires)","Enter Watts"]
[{"$nulls":39},"LED (DLC Indoor Retrofit Kit)","LED (DLC Retrofit Kits-High-bay Luminaires-C&I Buildings)","Enter Watts"]
[{"$nulls":39},"LED (DLC Indoor Retrofit Kit)","LED (DLC Retrofit Kits-Low-bay Luminaires-C&I Buildings)","Enter Watts"]
[{"$nulls":39},"LED (DLC Linear Replacement Lamp)","LED (DLC Four-foot Linear Replacement Lamps )","Enter Watts"]
[{"$nulls":39},"LED (DLC Linear Replacement Lamp)","LED (DLC Two-foot Linear Replacement Lamps )","Enter Watts"]
[{"$nulls":39},"LED (DLC Mogul Screw-Base HID Replacement)","LED (DLC Screw-base HID Lamp Replacement-Outdoor Pole/Arm-mounted Area & Roadway Luminaires)","Enter Watts"]
[{"$nulls":39},"LED (DLC Mogul Screw-Base HID Replacement)","LED (DLC Screw-base HID Lamp Replacement-Outdoor Pole/Arm-mounted Decorative Luminaires)","Enter Watts"]
[{"$nulls":39},"LED (DLC Mogul Screw-Base HID Replacement)","LED (DLC Screw-base HID Lamp Replacement-Outdoor Full Cut-off Wall-mounted Area Luminaires)","Enter Watts"]
[{"$nulls":39},"LED (DLC Mogul Screw-Base HID Replacement)","LED (DLC Screw-base HID Lamp Replacement-Parking Garage Luminaires)","Enter Watts"]
[{"$nulls":39},"LED (DLC Mogul Screw-Base HID Replacement)","LED (DLC Screw-base HID Lamp Replacement-Fuel Pump Canopy Luminaires)","Enter Watts"]
[{"$nulls":39},"LED (DLC Mogul Screw-Base HID Replacement)","LED (DLC Screw-base HID Lamp Replacement-High-bay Luminaires-C&I Buildings)","Enter Watts"]
[{"$nulls":39},"LED (DLC Mogul Screw-Base HID Replacement)","LED (DLC Screw-base HID Lamp Replacement-Low-bay Luminaires-C&I Buildings)","Enter Watts"]
[{"$nulls":39},"Mercury Vapor","40 watt MV",50]
[{"$nulls":39},"Mercury Vapor","50 watt MV",75]
[{"$nulls":39},"Mercury Vapor","75 watt MV",94]
[{"$nulls":39},"Mercury Vapor","100 watt MV",124]
[{"$nulls":39},"Mercury Vapor","175 watt MV",205]
[{"$nulls":39},"Mercury Vapor","250 watt MV",288]
[{"$nulls":39},"Mercury Vapor","400 watt MV",455]
[{"$nulls":39},"Mercury Vapor","1000 watt MV",1079]
[{"$nulls":39},"Metal Halide","20/22 watt MH",25]
[{"$nulls":39},"Metal Halide","32 watt MH",40]
[{"$nulls":39},"Metal Halide","35/39 watt MH",52]
[{"$nulls":39},"Metal Halide","50 watt MH",65]
[{"$nulls":39},"Metal Halide","70 watt MH",94]
[{"$nulls":39},"Metal Halide","100 watt MH",126]
[{"$nulls":39},"Metal Halide","150 watt MH",179]
[{"$nulls":39},"Metal Halide","175 watt MH",210]
[{"$nulls":39},"Metal Halide","200 watt MH",232]
[{"$nulls":39},"Metal Halide","250 watt MH",293]
[{"$nulls":39},"Metal Halide","400 watt MH",455]
[{"$nulls":39},"Metal Halide","1000 watt MH",1079]
[{"$nulls":39},"Metal Halide","1500 watt MH",1609]
[{"$nulls":39},"Metal Halide","1650 watt MH",1765]
[{"$nulls":39},"Metal Halide","2000 watt MH",2140]
[{"$nulls":39},"Pulse Start Metal Halide","50 watt PSMH",67]
[{"$nulls":39},"Pulse Start Metal Halide","70 watt PSMH",88]
[{"$nulls":39},"Pulse Start Metal Halide","100 watt PSMH",123]
[{"$nulls":39},"Pulse Start Metal Halide","125 watt PSMH",146]
[{"$nulls":39},"Pulse Start Metal Halide","150 watt PSMH",181]
[{"$nulls":39},"Pulse Start Metal Halide","175 watt PSMH",199]
[{"$nulls":39},"Pulse Start Metal Halide","200 watt PSMH",225]
[{"$nulls":39},"Pulse Start Metal Halide","250 watt PSMH",281]
[{"$nulls":39},"Pulse Start Metal Halide","320 watt PSMH",356]
[{"$nulls":39},"Pulse Start Metal Halide","350 watt PSMH",393]
[{"$nulls":39},"Pulse Start Metal Halide","400 watt PSMH",445]
[{"$nulls":39},"Pulse Start Metal Halide","450 watt PSMH",493]
[{"$nulls":39},"Pulse Start Metal Halide"," 750 watt PSMH",812]
[{"$nulls":39},"Pulse Start Metal Halide","775 watt PSMH",855]
[{"$nulls":39},"Pulse Start Metal Halide","875 watt PSMH",950]
[{"$nulls":39},"Pulse Start Metal Halide","1000 watt PSMH",1079]
[{"$nulls":39},"Neon","9mm Neon",15]
[{"$nulls":39},"Neon","10mm Neon",13]
[{"$nulls":39},"Neon","11mm Neon",10]
[{"$nulls":39},"Neon","12mm Neon",8]
[{"$nulls":39},"Neon","13mm Neon",7]
[{"$nulls":39},"Neon","14mm Neon",7]
[{"$nulls":39},"Neon","15mm Neon",7]
[{"$nulls":39},"Neon","18mm Neon",6]
[{"$nulls":39},"Neon","20mm Neon",5]
[{"$nulls":39},"Neon","22mm Neon",4]
[{"$nulls":39},"Neon","25mm Neon",3]
[{"$nulls":39},"Other Lamp or Fixture","None",0]
[{"$nulls":39},"Other Lamp or Fixture","Other (Describe)","Enter Watts"]

{"sheet":"QPLs","index":3,"n_rows":26,"n_cols":16,"rows_kept":26}
["Insert/Embed Equipment and Controls DLC QPLs"]
[{"$nulls":6},"How to Embed a PDF File in an Excel Worksheet"]
[{"$nulls":6},"1. Go to Insert tab and click on the Object icon in the Text group. ..."]
[{"$nulls":6},"2. In the Object dialog box, select the 'Create New' tab and the select 'Adobe Acrobat Document' from the list. ..."]
[{"$nulls":6},"3. Check the option – 'Display as icon'."]
[{"$nulls":6},"4. If desired, select \"Change Icon\" to modify the file name displayed (ex: Model XYZ QPL, Model ABC QPL, etc.).  "]
[{"$nulls":6},"5. Click OK."]
[{"$nulls":6},"6. Select the PDF file to embed and click on Open."]
[]
[{"$nulls":6},"1)",{"$nulls":8},"2 - 5)"]
{"$rows_empty":15}
[{"$nulls":15},"6)"]

{"sheet":"Invoice_Optional","index":4,"n_rows":1,"n_cols":1,"rows_kept":1,"hidden":true}
["Insert/Embed Invoice **Optional**"]

{"sheet":"Savings and Incentives","index":5,"n_rows":55,"n_cols":17,"rows_kept":55,"merged":[[2,5,2,6],[3,1,3,3],[4,1,4,3],[5,1,5,3],[6,1,6,3],[6,5,10,5],[7,1,7,3],[8,1,8,3],[10,1,10,3],[11,1,11,3],[12,1,12,3],[13,1,13,3],[14,0,14,4],[16,1,16,3],[17,1,17,3],[47,1,47,5],[48,1,48,3],[48,4,48,5],[49,1,49,3],[50,1,50,2],[51,1,53,1],[53,4,53,5],[54,1,54,2]]}
[{"$nulls":5},"Last Updated: ",{"$f":"MAX('Version History'!$B$5:$B$40)","v":"2022-12-22"}]
["section 6","Additional Information"]
[]
[null,"L5029: CLS - Fixture or Retrofit Kit Only"]
[null,"L5031: CLS - Fixture or Retrofit Kit/Lamp with Connected Controls, Interior"]
[null,"L5030: CLS - Fixture or Retrofit Kit/Lamp with Connected Controls, Exterior"]
[]
[]
[null,"SECTOR (Choose from dropdown)"]
[]
[]
[null,"EXISTING AVERAGE FOOTCANDLES*"]
[]
[null,"PROPOSED AVERAGE FOOTCANDLES*"]
["*Footcandles (either measured or calculated) at working surface for space type with largest square footage"]
[]
[]
[null,"ESTIMATED COMPLETION DATE"]
[]
[]
["section 7","Energy Savings  (If TA calc used, paste or link savings values from calc tab)"]
[null,null,"L5029","L5031","L5030"]
[null,"Annual kW Savings",{"$f":"Calculations!K1027","v":0},{"$f":"Calculations!K1028","v":0},{"$f":"Calculations!K1029","v":0}]
[null,"Annual kWh Savings",{"$f":"Calculations!L1027","v":0},{"$f":"Calculations!L1028","v":0},{"$f":"Calculations!L1029","v":0}]
[null,"Lifecycle kWh Savings",{"$f":"Calculations!M1027","v":0},{"$f":"Calculations!M1028","v":0},{"$f":"Calculations!M1029","v":0}]
[]
[{"$nulls":13},"CLS - Fixture or Retrofit Kit Only ",null,null,0.25]
[{"$nulls":13},"CLS - Fixture or Retrofit Kit/Lamp with Connected Controls, Interior",null,null,0.45]
["section 8","Estimated Incentive Amount (If TA calc used, paste or link watts reduced values from calc tab)",{"$nulls":11},"CLS - Fixture or Retrofit Kit/Lamp with Connected Controls, Exterior",null,null,0.5]
[]
[null,null,"L5029","L5031","L5030"]
[null,"Project Cost",{"$f":"SUMIF(Calculations!AB20:AB1019, \"L5029\", Calculations!AE20:AE1019)","v":0},{"$f":"SUMIF(Calculations!AB20:AB1019, \"L5031\", Calculations!AE20:AE1019)","v":0},{"$f":"SUMIF(Calculations!AB20:AB1019, \"L5030\", Calculations!AE20:AE1019)","v":0}]
[null,"Incentive Rate ($/Watt Reduced)",{"v":0.25,"d":"$0.25"},{"v":0.45,"d":"$0.45"},{"v":0.5,"d":"$0.50"}]
[null,"Watts Reduced",{"$f":"Calculations!R1027","v":0},{"$f":"Calculations!R1028","v":0},{"$f":"Calculations!R1029","v":0}]
[null,"Total Incentive",{"$f":"C33*C34","v":0},{"$f":"D33*D34","v":0},0]
[]
[null,"Incentive Limits"]
[null,"Incentive Capped at 50% Cost",{"$f":"IFERROR(ROUND(C32*0.5,2),\"\")","v":0},{"$f":"IFERROR(ROUND(D32*0.5,2),\"\")","v":0},0]
[null,"Incentive Capped at $300,000",{"$f":"MIN(C35,300000)","v":0},{"$f":"MIN(D35,300000)","v":0},0]
[null,"Incentive Based on Energy Savings",{"$f":"IFERROR(C35,\"\")","v":0},{"$f":"IFERROR(D35,\"\")","v":0},0]
[null,"Final Incentive",{"$f":"MIN(C38:C40)","v":0},{"$f":"MIN(D38:D40)","v":0},{"$f":"MIN(E38:E40)","v":0}]
[]
[null,"Estimated Annual Cost Savings",{"$f":"IFERROR(C24*$D$52,0)","v":0},{"$f":"IFERROR(D24*$D$52,0)","v":0},{"$f":"IFERROR(E24*$D$52,0)","v":0}]
[null,"Simple Payback without Incentive",{"$f":"ROUND(IFERROR(C32/C43,0),2)","v":{"v":0,"d":"0.00"}},{"$f":"ROUND(IFERROR(D32/D43,0),2)","v":{"v":0,"d":"0.00"}},{"v":0,"d":"0.00"}]
[null,"Simple Payback with Incentive",{"$f":"ROUND(IFERROR((C32-C41)/C43,0),2)","v":{"v":0,"d":"0.00"}},{"$f":"ROUND(IFERROR((D32-D41)/D43,0),2)","v":{"v":0,"d":"0.00"}},{"v":0,"d":"0.00"}]
[]
[]
[null,"Price Data"]
[null,"EIA WI Yearly Electricity Price Data",null,null,"          Copy of EIA Data:"]
[null,"https://www.eia.gov/electricity/data/browser/#/topic/7?agg=0,1&geo=00001&endsec=vg&linechart=ELEC.PRICE.WI-ALL.M&columnchart=ELEC.PRICE.WI-ALL.M&map=ELEC.PRICE.WI-ALL.M&freq=M&start=202101&end=202203&ctype=linechart&ltype=pin&rtype=s&pin=&rse=0&maptype=0"]
[null,"Usage Profile",null,"Dollars per kWh"]
[null,"Interior or 24/7 (On-Peak)","Commercial",{"v":0.1109,"d":"$0.1109"}]
[null,null,"Industrial",{"v":0.0776,"d":"$0.0776"}]
[null,null,"Residential",{"v":0.1587,"d":"$0.1587"},"Accessed Jun 23 2022"]
[null,"Exterior (Off-Peak)",null,{"v":0.08,"d":"$0.0800"}]